You are not logged in.

#2951 2017-01-24 16:14:53

TristeShine
Member
From: France
Registered: 2016-10-23
Posts: 12

Re: Progress on Unity under Arch Linux!

horsemanoffaith wrote:
TristeShine wrote:

I have tried all methods that I found to install the unity desktop environment on my Arch but failed.
The best result that I got is the login interface. But when I type in the password, the desktop doesn't show up while the login page shows again.

I am doubting if the project is always under maintenance ? Have you ever succeeded in installing it ?
Or is there another desktop environment which supports a global menu like unity and works welll with Arch ?

Thanks for your response.

Yes, the project is under maintenance by two different people- myself and Chenxiaolong on Github. My Github page is not updated yet, but I just finished a successful build on my desktop and will be updating the files on Github as soon as I'm able. I have two successful installs- one on my desktop and one on my laptop. Both seem to be working correctly.

Please attempt to log in to Unity again, then use another DE/WM and post the output of

 $journalctl --user --since=today

I think I may know what the issue is, but I need to see your journal to know for sure. I was having the same issue on a new build on my desktop and was able to get it working.

Thank you so much for your response, and of course your work of maitenance of this project.
In fact, last time, I installed it from repository and got the login page.Then I found the response of chenxiaolong to an issue on github which says that the repository is no longer maintained.
So, I reinitialized my system and tried to build from source code. Now a new problem is, I failed to build the gtk3-ubuntu package.
The error is :

Failure while downloading https://launchpad.net/ubuntu/+archive/primary/+files/gtk+3.0_3.22.4-1ubuntu2.debian.tar.xz

I tried also installing this single pacakge from AUR. However, the gtk+3.0 package did not pass the sha512sums validity check.

So I am now blocked here.

Last edited by TristeShine (2017-01-24 16:15:26)

Offline

#2952 2017-01-24 18:04:27

TristeShine
Member
From: France
Registered: 2016-10-23
Posts: 12

Re: Progress on Unity under Arch Linux!

horsemanoffaith wrote:
TristeShine wrote:

I have tried all methods that I found to install the unity desktop environment on my Arch but failed.
The best result that I got is the login interface. But when I type in the password, the desktop doesn't show up while the login page shows again.

I am doubting if the project is always under maintenance ? Have you ever succeeded in installing it ?
Or is there another desktop environment which supports a global menu like unity and works welll with Arch ?

Thanks for your response.

Yes, the project is under maintenance by two different people- myself and Chenxiaolong on Github. My Github page is not updated yet, but I just finished a successful build on my desktop and will be updating the files on Github as soon as I'm able. I have two successful installs- one on my desktop and one on my laptop. Both seem to be working correctly.

Please attempt to log in to Unity again, then use another DE/WM and post the output of

 $journalctl --user --since=today

I think I may know what the issue is, but I need to see your journal to know for sure. I was having the same issue on a new build on my desktop and was able to get it working.

I reinstalled it. Here is the journal log:

Jan 24 18:54:53 X42J systemd[479]: Starting D-Bus User Message Bus Socket.
Jan 24 18:54:53 X42J systemd[479]: Reached target Paths.
Jan 24 18:54:53 X42J systemd[479]: Reached target Timers.
Jan 24 18:54:53 X42J systemd[479]: Listening on Sound System.
Jan 24 18:54:53 X42J systemd[479]: Listening on D-Bus User Message Bus Socket.
Jan 24 18:54:53 X42J systemd[479]: Reached target Sockets.
Jan 24 18:54:53 X42J systemd[479]: Reached target Basic System.
Jan 24 18:54:53 X42J systemd[479]: Starting Update XDG user dir configuration...
Jan 24 18:54:53 X42J systemd[479]: Started Update XDG user dir configuration.
Jan 24 18:54:53 X42J systemd[479]: Reached target Default.
Jan 24 18:54:53 X42J systemd[479]: Startup finished in 333ms.
Jan 24 18:54:54 X42J systemd[479]: Started D-Bus User Message Bus.
Jan 24 18:54:54 X42J systemd[479]: Stopped target Default.
Jan 24 18:54:54 X42J systemd[479]: Stopping D-Bus User Message Bus...
Jan 24 18:54:54 X42J systemd[479]: Stopped D-Bus User Message Bus.
Jan 24 18:54:54 X42J systemd[479]: Stopped target Basic System.
Jan 24 18:54:54 X42J systemd[479]: Stopped target Timers.
Jan 24 18:54:54 X42J systemd[479]: Stopped target Paths.
Jan 24 18:54:54 X42J systemd[479]: Stopped target Sockets.
Jan 24 18:54:54 X42J systemd[479]: Closed Sound System.
Jan 24 18:54:54 X42J systemd[479]: Closed D-Bus User Message Bus Socket.
Jan 24 18:54:54 X42J systemd[479]: Reached target Shutdown.
Jan 24 18:54:54 X42J systemd[479]: Starting Exit the Session...
Jan 24 18:54:54 X42J systemd[479]: Received SIGRTMIN+24 from PID 508 (kill).
Jan 24 18:55:01 X42J systemd[651]: Starting D-Bus User Message Bus Socket.
Jan 24 18:55:01 X42J systemd[651]: Reached target Timers.
Jan 24 18:55:01 X42J systemd[651]: Reached target Paths.
Jan 24 18:55:01 X42J systemd[651]: Listening on Sound System.
Jan 24 18:55:01 X42J systemd[651]: Listening on D-Bus User Message Bus Socket.
Jan 24 18:55:01 X42J systemd[651]: Reached target Sockets.
Jan 24 18:55:01 X42J systemd[651]: Reached target Basic System.
Jan 24 18:55:01 X42J systemd[651]: Starting Update XDG user dir configuration...
Jan 24 18:55:01 X42J systemd[651]: Started Update XDG user dir configuration.
Jan 24 18:55:01 X42J systemd[651]: Reached target Default.
Jan 24 18:55:01 X42J systemd[651]: Startup finished in 31ms.
Jan 24 18:55:01 X42J systemd[651]: Started D-Bus User Message Bus.
Jan 24 18:55:07 X42J ksplashqml[688]: Loading stage  "initial" 1185
Jan 24 18:55:08 X42J klauncher[711]: Connecting to deprecated signal QDBusConnectionInterface::serviceOwnerChanged(QString,QString,QString)
Jan 24 18:55:09 X42J kdeinit5[717]: Initializing  "kcm_kgamma" :  "kcminit_kgamma"
Jan 24 18:55:09 X42J kdeinit5[717]: Initializing  "kded_touchpad" :  "kcminit_touchpad"
Jan 24 18:55:09 X42J kdeinit5[717]: Initializing  "kcm_input" :  "kcminit_mouse"
Jan 24 18:55:09 X42J kdeinit5[717]: Initializing  "kcm_access" :  "kcminit_access"
Jan 24 18:55:09 X42J kdeinit5[717]: Initializing  "kcm_style" :  "kcminit_style"
Jan 24 18:55:09 X42J kdeinit5[714]: kf5.kded: No X-KDE-DBus-ServiceName found in "/usr/lib/qt/plugins/kf5/kded/khotkeys.so"
Jan 24 18:55:09 X42J kdeinit5[714]: kf5.kded: No X-KDE-DBus-ServiceName found in "/usr/lib/qt/plugins/kf5/kded/keyboard.so"
Jan 24 18:55:09 X42J kdeinit5[714]: kf5.kded: No X-KDE-DBus-ServiceName found in "/usr/lib/qt/plugins/kf5/kded/kwrited.so"
Jan 24 18:55:09 X42J kdeinit5[714]: kf5.kded: No X-KDE-DBus-ServiceName found in "/usr/lib/qt/plugins/kf5/kded/networkmanagement.so"
Jan 24 18:55:09 X42J kdeinit5[714]: kf5.kded: No X-KDE-DBus-ServiceName found in "/usr/lib/qt/plugins/kf5/kded/remotedirnotify.so"
Jan 24 18:55:09 X42J kdeinit5[714]: kf5.kded: No X-KDE-DBus-ServiceName found in "/usr/lib/qt/plugins/kf5/kded/proxyscout.so"
Jan 24 18:55:09 X42J kdeinit5[714]: kf5.kded: No X-KDE-DBus-ServiceName found in "/usr/lib/qt/plugins/kf5/kded/ksysguard.so"
Jan 24 18:55:09 X42J kdeinit5[714]: kf5.kded: No X-KDE-DBus-ServiceName found in "/usr/lib/qt/plugins/kf5/kded/ktimezoned.so"
Jan 24 18:55:09 X42J kdeinit5[714]: kf5.kded: No X-KDE-DBus-ServiceName found in "/usr/lib/qt/plugins/kf5/kded/baloosearchmodule.so"
Jan 24 18:55:09 X42J kdeinit5[714]: kf5.kded: No X-KDE-DBus-ServiceName found in "/usr/lib/qt/plugins/kf5/kded/appmenu.so"
Jan 24 18:55:09 X42J kdeinit5[714]: kf5.kded: No X-KDE-DBus-ServiceName found in "/usr/lib/qt/plugins/kf5/kded/solidautoeject.so"
Jan 24 18:55:09 X42J kdeinit5[714]: kf5.kded: No X-KDE-DBus-ServiceName found in "/usr/lib/qt/plugins/kf5/kded/networkstatus.so"
Jan 24 18:55:09 X42J kdeinit5[714]: kf5.kded: No X-KDE-DBus-ServiceName found in "/usr/lib/qt/plugins/kf5/kded/desktopnotifier.so"
Jan 24 18:55:09 X42J kdeinit5[714]: kf5.kded: No X-KDE-DBus-ServiceName found in "/usr/lib/qt/plugins/kf5/kded/statusnotifierwatcher.so"
Jan 24 18:55:09 X42J kdeinit5[714]: kf5.kded: No X-KDE-DBus-ServiceName found in "/usr/lib/qt/plugins/kf5/kded/freespacenotifier.so"
Jan 24 18:55:09 X42J kdeinit5[714]: kf5.kded: No X-KDE-DBus-ServiceName found in "/usr/lib/qt/plugins/kf5/kded/soliduiserver.so"
Jan 24 18:55:09 X42J kdeinit5[714]: kf5.kded: No X-KDE-DBus-ServiceName found in "/usr/lib/qt/plugins/kf5/kded/kscreen.so"
Jan 24 18:55:09 X42J kdeinit5[714]: kf5.kded: No X-KDE-DBus-ServiceName found in "/usr/lib/qt/plugins/kf5/kded/bluedevil.so"
Jan 24 18:55:09 X42J kdeinit5[714]: kf5.kded: No X-KDE-DBus-ServiceName found in "/usr/lib/qt/plugins/kf5/kded/device_automounter.so"
Jan 24 18:55:09 X42J kaccess[723]: kf5.kcoreaddons.kaboutdata: Could not initialize the equivalent properties of Q*Application: no instance (yet)
Jan 24 18:55:10 X42J dbus-daemon[677]: Activating service name='ca.desrt.dconf'
Jan 24 18:55:10 X42J dbus-daemon[677]: Successfully activated service 'ca.desrt.dconf'
Jan 24 18:55:11 X42J dbus-daemon[677]: Activating service name='org.kde.kglobalaccel'
Jan 24 18:55:11 X42J dbus-daemon[677]: Successfully activated service 'org.kde.kglobalaccel'
Jan 24 18:55:11 X42J kaccess[723]: detected kglobalaccel restarting, re-registering all shortcut keys
Jan 24 18:55:12 X42J kdeinit5[714]: detected kglobalaccel restarting, re-registering all shortcut keys
Jan 24 18:55:12 X42J dbus-daemon[677]: Activating service name='org.kde.KScreen'
Jan 24 18:55:12 X42J dbus-daemon[677]: Successfully activated service 'org.kde.KScreen'
Jan 24 18:55:12 X42J kscreen_backend_launcher[749]: kscreen.xrandr: Connected output 67 to CRTC 63
Jan 24 18:55:12 X42J kscreen_backend_launcher[749]: kscreen.xcb.helper: Detected XRandR 1.5
Jan 24 18:55:12 X42J kscreen_backend_launcher[749]: kscreen.xcb.helper: Event Base:  89
Jan 24 18:55:12 X42J kscreen_backend_launcher[749]: kscreen.xcb.helper: Event Error:  147
Jan 24 18:55:12 X42J kdeinit5[714]: QDBusConnection: name 'org.freedesktop.UDisks2' had owner '' but we thought it was ':1.93'
Jan 24 18:55:12 X42J kdeinit5[714]: kscreen.kded: Config KScreen::Config(0x7f5bc0) is ready
Jan 24 18:55:12 X42J kdeinit5[714]: kscreen.kded: PowerDevil SuspendSession action not available!
Jan 24 18:55:12 X42J kdeinit5[714]: kscreen.kded: "The name org.kde.Solid.PowerManagement was not provided by any .service files"
Jan 24 18:55:12 X42J kdeinit5[714]: kscreen.kded: Applying config
Jan 24 18:55:12 X42J kdeinit5[714]: kscreen.kded: Applying known config "f06527156806e315bdf6966e24c0a7b0"
Jan 24 18:55:12 X42J kdeinit5[714]: kscreen.kded: Finding a mode for QSize(1366, 768) @ 60.0984
Jan 24 18:55:12 X42J kdeinit5[714]: kscreen.kded:         Found:  "71"   QSize(1366, 768) @ 60.0984
Jan 24 18:55:12 X42J kdeinit5[714]: kscreen.kded: doApplyConfig()
Jan 24 18:55:12 X42J kscreen_backend_launcher[749]: kscreen.xrandr: XRandR::setConfig
Jan 24 18:55:12 X42J kscreen_backend_launcher[749]: kscreen.xrandr: Requested screen size is QSize(1366, 768)
Jan 24 18:55:12 X42J kscreen_backend_launcher[749]: kscreen.xrandr: Needed CRTCs:  1
Jan 24 18:55:12 X42J kscreen_backend_launcher[749]: kscreen.xrandr: Actions to perform:
Jan 24 18:55:12 X42J kscreen_backend_launcher[749]: kscreen.xrandr:         Primary Output: false
Jan 24 18:55:12 X42J kscreen_backend_launcher[749]: kscreen.xrandr:         Change Screen Size: false
Jan 24 18:55:12 X42J kscreen_backend_launcher[749]: kscreen.xrandr:         Disable outputs: false
Jan 24 18:55:12 X42J kscreen_backend_launcher[749]: kscreen.xrandr:         Change outputs: false
Jan 24 18:55:12 X42J kscreen_backend_launcher[749]: kscreen.xrandr:         Enable outputs: false
Jan 24 18:55:12 X42J kscreen_backend_launcher[749]: kscreen.xrandr: XRandR::setConfig done!
Jan 24 18:55:12 X42J kdeinit5[714]: kscreen.kded: Config applied
Jan 24 18:55:12 X42J kdeinit5[714]: kscreen.kded: Monitor for changes:  true
Jan 24 18:55:12 X42J kdeinit5[714]: kscreen: Requesting missing EDID for outputs (67)
Jan 24 18:55:12 X42J kdeinit5[714]: kscreen.kded: Change detected
Jan 24 18:55:12 X42J kdeinit5[714]: kscreen.kded: KScreen::Output( 67   "LVDS-1" connected enabled QPoint(0,0) QSize(1366, 768) "71" )
Jan 24 18:55:12 X42J ksplashqml[688]: Loading stage  "kcminit" 6763
Jan 24 18:55:12 X42J ksplashqml[688]: Loading stage  "kinit" 6796
Jan 24 18:55:12 X42J kdeinit5[714]: kscreen.kded: Saving current config to file
Jan 24 18:55:12 X42J kdeinit5[714]: kscreen.kded: Config saved on:  "/home/sven/.local/share/kscreen/f06527156806e315bdf6966e24c0a7b0"
Jan 24 18:55:12 X42J kdeinit5[714]: kscreen.kded: KScreen::Output( 67   "LVDS-1" connected enabled QPoint(0,0) QSize(1366, 768) "71" )
Jan 24 18:55:13 X42J ksmserver[755]: Qt: Session management error: networkIdsList argument is NULL
Jan 24 18:55:13 X42J ksmserver[755]: Configuring Lock Action
Jan 24 18:55:13 X42J ksmserver[755]: ksmserver: "/run/user/1000/KSMserver"
Jan 24 18:55:13 X42J ksmserver[755]: ksmserver: KSMServer: SetAProc_loc: conn  0 , prot= local , file= @/tmp/.ICE-unix/755
Jan 24 18:55:13 X42J ksmserver[755]: ksmserver: KSMServer: SetAProc_loc: conn  1 , prot= unix , file= /tmp/.ICE-unix/755
Jan 24 18:55:13 X42J ksmserver[755]: ksmserver: KSMServer::restoreSession  "saved at previous logout"
Jan 24 18:55:13 X42J ksplashqml[688]: Loading stage  "ksmserver" 7046
Jan 24 18:55:13 X42J ksmserver[755]: ksmserver: Starting autostart service  "/etc/xdg/autostart/baloo_file.desktop"
Jan 24 18:55:13 X42J ksmserver[755]: ksmserver: Starting autostart service  "/etc/xdg/autostart/krunner.desktop"
Jan 24 18:55:13 X42J ksmserver[755]: ksmserver: Starting autostart service  "/etc/xdg/autostart/pam_kwallet_init.desktop"
Jan 24 18:55:13 X42J ksmserver[755]: ksmserver: Starting autostart service  "/etc/xdg/autostart/plasmashell.desktop"
Jan 24 18:55:13 X42J ksmserver[755]: ksmserver: Starting autostart service  "/etc/xdg/autostart/polkit-kde-authentication-agent-1.desktop"
Jan 24 18:55:13 X42J ksmserver[755]: ksmserver: Starting autostart service  "/etc/xdg/autostart/xembedsniproxy.desktop"
Jan 24 18:55:13 X42J ksmserver[755]: ksmserver: Autostart 0 done
Jan 24 18:55:13 X42J ksmserver[755]: Session path: "/org/freedesktop/login1/session/c4"
Jan 24 18:55:13 X42J ksmserver[755]: ksmserver: Kcminit phase 1 done
Jan 24 18:55:13 X42J ksmserver[755]: ksmserver: Starting autostart service  "/etc/xdg/autostart/pulseaudio.desktop"
Jan 24 18:55:13 X42J ksmserver[755]: ksmserver: Autostart 1 done
Jan 24 18:55:13 X42J ksmserver[755]: ksmserver: IO error opening ICE Connection!
Jan 24 18:55:13 X42J ksmserver[755]: ksmserver: autostart service "/usr/lib/pam_kwallet_init" finished with exit code  0
Jan 24 18:55:13 X42J polkit-kde-authentication-agent-1[763]: kf5.kcoreaddons.kaboutdata: Could not initialize the equivalent properties of Q*Appl
Jan 24 18:55:13 X42J systemd[651]: Starting Sound Service...
Jan 24 18:55:13 X42J ksmserver[755]: ksmserver: autostart service "/usr/bin/xembedsniproxy" finished with exit code  13
Jan 24 18:55:13 X42J polkit-kde-authentication-agent-1[763]: New PolkitAgentListener  0x1ca1ce0
Jan 24 18:55:13 X42J polkit-kde-authentication-agent-1[763]: Adding new listener  PolkitQt1::Agent::Listener(0x1cace50) for  0x1ca1ce0
Jan 24 18:55:13 X42J polkit-kde-authentication-agent-1[763]: Listener online
Jan 24 18:55:13 X42J polkit-kde-authentication-agent-1[763]: Authentication agent result: true
Jan 24 18:55:13 X42J ksmserver[755]: completeShutdownOrCheckpoint called
Jan 24 18:55:13 X42J kdeinit5[714]: Installing the delayed initialization callback.
Jan 24 18:55:14 X42J dbus-daemon[677]: Activating service name='org.gnome.GConf'
Jan 24 18:55:14 X42J dbus-daemon[677]: Successfully activated service 'org.gnome.GConf'
Jan 24 18:55:14 X42J systemd[651]: Started Sound Service.
Jan 24 18:55:14 X42J org_kde_powerdevil[766]: powerdevil: Backend loaded, loading core
Jan 24 18:55:14 X42J org_kde_powerdevil[766]: powerdevil: Core loaded, initializing backend
Jan 24 18:55:14 X42J kdeinit5[714]: Trying to convert empty KLocalizedString to QString.
Jan 24 18:55:14 X42J kdeinit5[714]: Trying to convert empty KLocalizedString to QString.
Jan 24 18:55:14 X42J kdeinit5[714]: Trying to convert empty KLocalizedString to QString.
Jan 24 18:55:14 X42J org_kde_powerdevil[766]: powerdevil: Falling back to helper to get brightness
Jan 24 18:55:14 X42J kactivitymanagerd[798]: Config timer connecting...
Jan 24 18:55:14 X42J kdeinit5[714]: org.kde.kcm_keyboard: Failed to open layout memory xml file for reading "/home/sven/.local/share/kded5/keyboa
Jan 24 18:55:14 X42J org_kde_powerdevil[766]: powerdevil: current screen brightness value:  5
Jan 24 18:55:14 X42J org_kde_powerdevil[766]: powerdevil: Backend is ready, KDE Power Management system initialized
Jan 24 18:55:14 X42J kactivitymanagerd[798]: Setting the name of  0x21c3310  to  "org.kde.ActivityManager.RunApplication"
Jan 24 18:55:14 X42J kactivitymanagerd[798]: Setting the name of  0x2219df0  to  "org.kde.ActivityManager.Resources.Scoring"
Jan 24 18:55:14 X42J kactivitymanagerd[798]: Creating directory:  "/home/sven/.local/share/kactivitymanagerd/resources/"
Jan 24 18:55:14 X42J org_kde_powerdevil[766]: powerdevil: Battery with UDI "/org/freedesktop/UPower/devices/battery_BAT0" was detected
Jan 24 18:55:14 X42J org_kde_powerdevil[766]: powerdevil: Session path: "/org/freedesktop/login1/session/c4"
Jan 24 18:55:14 X42J org_kde_powerdevil[766]: powerdevil: ACTIVE SESSION PATH: "/org/freedesktop/login1/session/c4"
Jan 24 18:55:14 X42J org_kde_powerdevil[766]: powerdevil: Current session is now active
Jan 24 18:55:14 X42J org_kde_powerdevil[766]: powerdevil: fd passing available: true
Jan 24 18:55:14 X42J org_kde_powerdevil[766]: powerdevil: systemd powersave events handling inhibited, descriptor: 20
Jan 24 18:55:14 X42J org_kde_powerdevil[766]: powerdevil: systemd support initialized
Jan 24 18:55:14 X42J org_kde_powerdevil[766]: powerdevil: Got a valid offer for  "DPMSControl"
Jan 24 18:55:14 X42J org_kde_powerdevil[766]: powerdevil: Core is ready, registering various services on the bus...
Jan 24 18:55:14 X42J org_kde_powerdevil[766]: powerdevil: Can't contact ck
Jan 24 18:55:14 X42J org_kde_powerdevil[766]: powerdevil: We are now into activity  "c8942e40-f3ea-44c9-ada8-6323f8582e9a"
Jan 24 18:55:14 X42J org_kde_powerdevil[766]: powerdevil: () ()
Jan 24 18:55:14 X42J org_kde_powerdevil[766]: powerdevil: () ()
Jan 24 18:55:14 X42J org_kde_powerdevil[766]: powerdevil: Loading profile for plugged AC
Jan 24 18:55:14 X42J org_kde_powerdevil[766]: powerdevil: Activity is not forcing a profile
Jan 24 18:55:14 X42J org_kde_powerdevil[766]: powerdevil:
Jan 24 18:55:14 X42J org_kde_powerdevil[766]: powerdevil: Loading timeouts with  300000
Jan 24 18:55:14 X42J org_kde_powerdevil[766]: powerdevil: Handle button events action could not check for screen configuration
Jan 24 18:55:14 X42J kactivitymanagerd[798]: KActivities: Database connection:  "kactivities_db_resources_140240702553984_readwrite" 
                                                 query_only:          QVariant(qlonglong, 0) 
                                                 journal_mode:        QVariant(QString, "wal") 
                                                 wal_autocheckpoint:  QVariant(qlonglong, 100) 
                                                 synchronous:         QVariant(qlonglong, 1)
Jan 24 18:55:14 X42J kactivitymanagerd[798]: Setting the name of  0x22193e0  to  "org.kde.ActivityManager.ActivityTemplates"
Jan 24 18:55:14 X42J kactivitymanagerd[784]: Cleaning up...
Jan 24 18:55:15 X42J kdeinit5[714]: kf5.kio.core: Refilling KProtocolInfoFactory cache in the hope to find "mtp"
Jan 24 18:55:15 X42J kdeinit5[714]: bluedevil: Created
Jan 24 18:55:15 X42J kdeinit5[714]: kf5.kded: found kded module "touchpad" by prepending 'kded_' to the library path, please fix your metadata.
Jan 24 18:55:15 X42J kdeinit5[714]: Delayed initialization.
Jan 24 18:55:15 X42J kdeinit5[714]: Reloading the khotkeys configuration
Jan 24 18:55:15 X42J ksmserver[755]: ksmserver: Starting notification thread
Jan 24 18:55:15 X42J ksmserver[755]: ksmserver: Kcminit phase 2 done
Jan 24 18:55:15 X42J ksmserver[755]: ksmserver: Starting autostart service  "/etc/xdg/autostart/powerdevil.desktop"
Jan 24 18:55:15 X42J ksmserver[755]: ksmserver: Starting autostart service  "/etc/xdg/autostart/zeitgeist-datahub.desktop"
Jan 24 18:55:15 X42J org_kde_powerdevil[766]: powerdevil: Can't contact ck
Jan 24 18:55:15 X42J ksmserver[755]: ksmserver: Starting autostart service  "/etc/xdg/autostart/fcitx-autostart.desktop"
Jan 24 18:55:15 X42J kdeinit5[714]: Version 2 File!
Jan 24 18:55:15 X42J ksmserver[755]: ksmserver: Autostart 2 done
Jan 24 18:55:15 X42J ksmserver[755]: ksmserver: autostart service "/usr/bin/start-pulseaudio-x11" finished with exit code  0
Jan 24 18:55:15 X42J ksplashqml[688]: Loading stage  "ready" 9358
Jan 24 18:55:15 X42J ksmserver[755]: ksmserver: autostart service "/usr/lib/org_kde_powerdevil" finished with exit code  0
Jan 24 18:55:15 X42J kdeinit5[714]: true
Jan 24 18:55:15 X42J kdeinit5[714]: Imported file "/usr/share/khotkeys/kde32b1.khotkeys"
Jan 24 18:55:15 X42J kdeinit5[714]: Imported file "/usr/share/khotkeys/konqueror_gestures_kde321.khotkeys"
Jan 24 18:55:15 X42J kdeinit5[714]: Imported file "/usr/share/khotkeys/defaults.khotkeys"
Jan 24 18:55:15 X42J kdeinit5[714]: bluedevil: Bluetooth operational changed false
Jan 24 18:55:15 X42J kdeinit5[714]: bluedevil: ObexManager operational changed false
Jan 24 18:55:15 X42J dbus-daemon[677]: Activating via systemd: service name='org.bluez.obex' unit='dbus-org.bluez.obex.service'
Jan 24 18:55:15 X42J kdeinit5[714]: BluezQt: PendingCall Error: "Unit dbus-org.bluez.service not found."
Jan 24 18:55:16 X42J kwin_x11[758]: "\"fsrestore1\" - conversion of \"0,0,0,0\" to QRect failed"
Jan 24 18:55:16 X42J systemd[651]: Starting Bluetooth OBEX service...
Jan 24 18:55:16 X42J ksplashqml[688]: Loading stage  "wm" 10523
Jan 24 18:55:16 X42J ksmserver[755]: completeShutdownOrCheckpoint called
Jan 24 18:55:17 X42J kwin_x11[758]: kf5.kcoreaddons.desktopparser: Could not locate service type file kservicetypes5/kwin-script.desktop, tried ("/home/sven/.local/share", "/usr/share", "/us
Jan 24 18:55:17 X42J kwin_x11[758]: kf5.kcoreaddons.desktopparser: Could not locate service type file kservicetypes5/kwin-script.desktop, tried ("/home/sven/.local/share", "/usr/share", "/us
Jan 24 18:55:17 X42J kwin_x11[758]: kf5.kcoreaddons.desktopparser: Could not locate service type file kservicetypes5/kwin-script.desktop, tried ("/home/sven/.local/share", "/usr/share", "/us
Jan 24 18:55:17 X42J kwin_x11[758]: kf5.kcoreaddons.desktopparser: Could not locate service type file kservicetypes5/kwin-script.desktop, tried ("/home/sven/.local/share", "/usr/share", "/us
Jan 24 18:55:17 X42J kwin_x11[758]: kf5.kcoreaddons.desktopparser: Could not locate service type file kservicetypes5/kwin-script.desktop, tried ("/home/sven/.local/share", "/usr/share", "/us
Jan 24 18:55:17 X42J plasmashell[762]: kf5.kcoreaddons.desktopparser: Could not locate service type file kservicetypes5/plasma-popupapplet.desktop, tried ("/home/sven/.local/share", "/usr/sh
Jan 24 18:55:17 X42J kwin_x11[758]: kf5.kcoreaddons.desktopparser: Could not locate service type file kservicetypes5/kwin-effect.desktop, tried ("/home/sven/.local/share", "/usr/share", "/us
Jan 24 18:55:17 X42J kwin_x11[758]: kf5.kcoreaddons.desktopparser: Could not locate service type file kservicetypes5/kwin-effect.desktop, tried ("/home/sven/.local/share", "/usr/share", "/us
Jan 24 18:55:17 X42J kwin_x11[758]: kf5.kcoreaddons.desktopparser: Could not locate service type file kservicetypes5/kwin-effect.desktop, tried ("/home/sven/.local/share", "/usr/share", "/us
Jan 24 18:55:17 X42J kwin_x11[758]: kf5.kcoreaddons.desktopparser: Could not locate service type file kservicetypes5/kwin-effect.desktop, tried ("/home/sven/.local/share", "/usr/share", "/us
Jan 24 18:55:17 X42J kwin_x11[758]: kf5.kcoreaddons.desktopparser: Could not locate service type file kservicetypes5/kwin-effect.desktop, tried ("/home/sven/.local/share", "/usr/share", "/us
Jan 24 18:55:17 X42J kwin_x11[758]: kf5.kcoreaddons.desktopparser: Could not locate service type file kservicetypes5/kwin-effect.desktop, tried ("/home/sven/.local/share", "/usr/share", "/us
Jan 24 18:55:17 X42J kwin_x11[758]: kf5.kcoreaddons.desktopparser: Could not locate service type file kservicetypes5/kwin-effect.desktop, tried ("/home/sven/.local/share", "/usr/share", "/us
Jan 24 18:55:18 X42J kwin_x11[758]: kf5.kcoreaddons.desktopparser: Could not locate service type file kservicetypes5/kwin-effect.desktop, tried ("/home/sven/.local/share", "/usr/share", "/us
Jan 24 18:55:18 X42J kwin_x11[758]: kf5.kcoreaddons.desktopparser: Could not locate service type file kservicetypes5/kwin-effect.desktop, tried ("/home/sven/.local/share", "/usr/share", "/us
Jan 24 18:55:18 X42J kwin_x11[758]: kf5.kcoreaddons.desktopparser: Could not locate service type file kservicetypes5/kwin-effect.desktop, tried ("/home/sven/.local/share", "/usr/share", "/us
Jan 24 18:55:18 X42J obexd[824]: OBEX daemon 5.43
Jan 24 18:55:18 X42J dbus-daemon[677]: Successfully activated service 'org.bluez.obex'
Jan 24 18:55:18 X42J systemd[651]: Started Bluetooth OBEX service.
Jan 24 18:55:18 X42J dbus-daemon[677]: Activating service name='org.gnome.zeitgeist.Engine'
Jan 24 18:55:18 X42J kdeinit5[714]: bluedevil: ObexManager operational changed true
Jan 24 18:55:18 X42J kdeinit5[714]: bluedevil: ObexAgent registered
Jan 24 18:55:19 X42J dbus-daemon[677]: Activating service name='org.gnome.zeitgeist.SimpleIndexer'
Jan 24 18:55:19 X42J dbus-daemon[677]: Successfully activated service 'org.gnome.zeitgeist.Engine'
Jan 24 18:55:19 X42J dbus-daemon[677]: Activating via systemd: service name='org.gtk.vfs.Daemon' unit='gvfs-daemon.service'
Jan 24 18:55:19 X42J org.gnome.zeitgeist.SimpleIndexer[677]: /usr/lib/zeitgeist/zeitgeist-fts: error while loading shared libraries: libxapian.so.22: cannot open shared object file: No such 
Jan 24 18:55:19 X42J dbus-daemon[677]: Activated service 'org.gnome.zeitgeist.SimpleIndexer' failed: Process org.gnome.zeitgeist.SimpleIndexer exited with status 127
Jan 24 18:55:19 X42J zeitgeist-datah[848]: zeitgeist-datahub.vala:229: Unable to get name "org.gnome.zeitgeist.datahub" on the bus!
Jan 24 18:55:19 X42J org.gnome.zeitgeist.Engine[677]: [18:55:19.064456 CRITICAL] file ext-fts.c: line 748: unexpected error: Error calling StartServiceByName for org.gnome.zeitgeist.SimpleIn
Jan 24 18:55:19 X42J systemd[651]: Starting Virtual filesystem service...
Jan 24 18:55:19 X42J dbus-daemon[677]: Successfully activated service 'org.gtk.vfs.Daemon'
Jan 24 18:55:19 X42J systemd[651]: Started Virtual filesystem service.
Jan 24 18:55:19 X42J baloo_file[759]: org.kde.baloo: "/home/sven"
Jan 24 18:55:20 X42J ksmserver[755]: ksmserver: autostart service "/usr/bin/fcitx-autostart" finished with exit code  0
Jan 24 18:55:20 X42J plasmashell[762]: kf5.kcoreaddons.desktopparser: Could not locate service type file kservicetypes5/plasma-popupapplet.desktop, tried ("/home/sven/.local/share", "/usr/sh
Jan 24 18:55:20 X42J plasmashell[762]: kf5.kcoreaddons.desktopparser: Could not locate service type file kservicetypes5/plasma-popupapplet.desktop, tried ("/home/sven/.local/share", "/usr/sh
Jan 24 18:55:20 X42J plasmashell[762]: kf5.kcoreaddons.desktopparser: Could not locate service type file kservicetypes5/plasma-popupapplet.desktop, tried ("/home/sven/.local/share", "/usr/sh
Jan 24 18:55:21 X42J plasmashell[762]: kf5.kcoreaddons.desktopparser: Could not locate service type file kservicetypes5/plasma-popupapplet.desktop, tried ("/home/sven/.local/share", "/usr/sh
Jan 24 18:55:23 X42J kdeinit5[714]: Registering "org.kde.StatusNotifierItem-877-1/StatusNotifierItem" to system tray
Jan 24 18:55:23 X42J baloo_file[759]: Power state changed
Jan 24 18:55:23 X42J plasmashell[762]: file:///usr/share/plasma/shells/org.kde.plasma.desktop/contents/views/Panel.qml:83: TypeError: Cannot read property 'Layout' of null
Jan 24 18:55:23 X42J plasmashell[762]: kf5.kcoreaddons.desktopparser: Could not locate service type file kservicetypes5/plasma-popupapplet.desktop, tried ("/home/sven/.local/share", "/usr/sh
Jan 24 18:55:24 X42J plasmashell[762]: Connecting to deprecated signal QDBusConnectionInterface::serviceOwnerChanged(QString,QString,QString)
Jan 24 18:55:25 X42J plasmashell[762]: Trying to use rootObject before initialization is completed, whilst using setInitializationDelayed. Forcing completion
Jan 24 18:55:25 X42J plasmashell[762]: file:///usr/share/plasma/plasmoids/org.kde.plasma.digitalclock/contents/ui/DigitalClock.qml:443:5: QML Text: Cannot anchor to a null item.
Jan 24 18:55:25 X42J kdeinit5[714]: Registering "org.kde.StatusNotifierHost-762" as system tray
Jan 24 18:55:25 X42J plasmashell[762]: file:///usr/lib/qt/qml/QtQuick/Controls/Button.qml:99: TypeError: Cannot read property of null
Jan 24 18:55:25 X42J plasmashell[762]: kf5.kcoreaddons.desktopparser: Could not locate service type file kservicetypes5/plasma-popupapplet.desktop, tried ("/home/sven/.local/share", "/usr/sh
Jan 24 18:55:25 X42J plasmashell[762]: kf5.kcoreaddons.desktopparser: Could not locate service type file kservicetypes5/plasma-popupapplet.desktop, tried ("/home/sven/.local/share", "/usr/sh
Jan 24 18:55:25 X42J plasmashell[762]: kf5.kcoreaddons.desktopparser: Could not locate service type file kservicetypes5/plasma-popupapplet.desktop, tried ("/home/sven/.local/share", "/usr/sh
Jan 24 18:55:25 X42J plasmashell[762]: kf5.kcoreaddons.desktopparser: Could not locate service type file kservicetypes5/plasma-popupapplet.desktop, tried ("/home/sven/.local/share", "/usr/sh
Jan 24 18:55:26 X42J plasmashell[762]: kf5.kcoreaddons.desktopparser: Could not locate service type file kservicetypes5/plasma-popupapplet.desktop, tried ("/home/sven/.local/share", "/usr/sh
Jan 24 18:55:26 X42J plasmashell[762]: kf5.kcoreaddons.desktopparser: Could not locate service type file kservicetypes5/plasma-popupapplet.desktop, tried ("/home/sven/.local/share", "/usr/sh
Jan 24 18:55:26 X42J plasmashell[762]: kf5.kcoreaddons.desktopparser: Could not locate service type file kservicetypes5/plasma-popupapplet.desktop, tried ("/home/sven/.local/share", "/usr/sh
Jan 24 18:55:26 X42J plasmashell[762]: kf5.kcoreaddons.desktopparser: Could not locate service type file kservicetypes5/plasma-popupapplet.desktop, tried ("/home/sven/.local/share", "/usr/sh
Jan 24 18:55:29 X42J plasmashell[762]: Notifications service registered
Jan 24 18:55:30 X42J dbus-daemon[677]: Activating service name='org.kde.kuiserver'
Jan 24 18:55:30 X42J dbus-daemon[677]: Successfully activated service 'org.kde.kuiserver'
Jan 24 18:55:30 X42J plasmashell[762]: Plasma Shell startup completed
Jan 24 18:55:30 X42J ksplashqml[688]: Loading stage  "desktop" 24400
Jan 24 18:55:30 X42J kwin_x11[758]: QXcbConnection: XCB error: 3 (BadWindow), sequence: 4838, resource id: 4194340, major code: 18 (ChangeProperty), minor code: 0
Jan 24 18:55:30 X42J plasmashell[762]: kf5.kcoreaddons.desktopparser: Could not locate service type file kservicetypes5/plasma-popupapplet.desktop, tried ("/home/sven/.local/share", "/usr/sh
Jan 24 18:55:30 X42J plasmashell[762]: kf5.kcoreaddons.desktopparser: Could not locate service type file kservicetypes5/plasma-popupapplet.desktop, tried ("/home/sven/.local/share", "/usr/sh
Jan 24 18:55:30 X42J plasmashell[762]: kf5.kcoreaddons.desktopparser: Could not locate service type file kservicetypes5/plasma-popupapplet.desktop, tried ("/home/sven/.local/share", "/usr/sh
Jan 24 18:55:30 X42J plasmashell[762]: kf5.kcoreaddons.desktopparser: Could not locate service type file kservicetypes5/plasma-popupapplet.desktop, tried ("/home/sven/.local/share", "/usr/sh
Jan 24 18:55:30 X42J plasmashell[762]: file:///usr/share/plasma/plasmoids/org.kde.plasma.battery/contents/ui/batterymonitor.qml:43: TypeError: Cannot read property 'Has Cumulative' of undefi
Jan 24 18:55:30 X42J plasmashell[762]: file:///usr/share/plasma/plasmoids/org.kde.plasma.battery/contents/ui/batterymonitor.qml:94: TypeError: Cannot read property 'Remaining msec' of undefi
Jan 24 18:55:30 X42J org_kde_powerdevil[766]: powerdevil: Screen brightness value:  5
Jan 24 18:55:30 X42J org_kde_powerdevil[766]: powerdevil: Screen brightness value max:  10
Jan 24 18:55:30 X42J org_kde_powerdevil[766]: powerdevil: Screen brightness value:  5
Jan 24 18:55:30 X42J org_kde_powerdevil[766]: powerdevil: Screen brightness value max:  10
Jan 24 18:55:30 X42J plasmashell[762]: Both point size and pixel size set. Using pixel size.
Jan 24 18:55:30 X42J plasmashell[762]: Couldn't find node arrow-down. Skipping rendering.
Jan 24 18:55:30 X42J plasmashell[762]: Couldn't find node arrow-up. Skipping rendering.
Jan 24 18:55:30 X42J plasmashell[762]: Couldn't find node arrow-right. Skipping rendering.
Jan 24 18:55:30 X42J plasmashell[762]: Couldn't find node arrow-left. Skipping rendering.
Jan 24 18:55:36 X42J plasmashell[762]: file:///usr/lib/qt/qml/QtQuick/Controls/Button.qml:99: TypeError: Cannot read property of null
Jan 24 18:55:36 X42J plasmashell[762]: file:///usr/lib/qt/qml/QtQuick/Controls/Button.qml:99: TypeError: Cannot read property of null
Jan 24 18:55:38 X42J plasmashell[762]: kf5.kio.core: Refilling KProtocolInfoFactory cache in the hope to find "mtp"
Jan 24 18:55:39 X42J kwin_x11[758]: QXcbConnection: XCB error: 3 (BadWindow), sequence: 5797, resource id: 35651729, major code: 18 (ChangeProperty), minor code: 0
Jan 24 18:55:41 X42J kactivitymanagerd[798]: Creating the cache for:  "applications:org.kde.konsole.desktop"
Jan 24 18:55:41 X42J kactivitymanagerd[798]: Already in database?  true
Jan 24 18:55:41 X42J kactivitymanagerd[798]:       First update :  QDateTime(2017-01-24 18:50:36.000 UTC Qt::TimeSpec(LocalTime))
Jan 24 18:55:41 X42J kactivitymanagerd[798]:        Last update :  QDateTime(2017-01-24 18:50:36.000 UTC Qt::TimeSpec(LocalTime))
Jan 24 18:55:41 X42J kactivitymanagerd[798]: After the adjustment
Jan 24 18:55:41 X42J kactivitymanagerd[798]:      Current score :  0
Jan 24 18:55:41 X42J kactivitymanagerd[798]:       First update :  QDateTime(2017-01-24 18:50:36.000 UTC Qt::TimeSpec(LocalTime))
Jan 24 18:55:41 X42J kactivitymanagerd[798]:        Last update :  QDateTime(2017-01-24 18:50:36.000 UTC Qt::TimeSpec(LocalTime))
Jan 24 18:55:41 X42J kactivitymanagerd[798]: Interval length is  0
Jan 24 18:55:41 X42J kactivitymanagerd[798]:          New score :  1
Jan 24 18:56:13 X42J kwin_x11[758]: QXcbConnection: XCB error: 3 (BadWindow), sequence: 8130, resource id: 35651749, major code: 18 (ChangeProperty), minor code: 0
Jan 24 18:56:14 X42J kactivitymanagerd[798]: Creating the cache for:  "applications:firefox.desktop"
Jan 24 18:56:14 X42J kactivitymanagerd[798]: Already in database?  false
Jan 24 18:56:14 X42J kactivitymanagerd[798]:       First update :  QDateTime(2017-01-24 18:56:14.000 UTC Qt::TimeSpec(LocalTime))
Jan 24 18:56:14 X42J kactivitymanagerd[798]:        Last update :  QDateTime(2017-01-24 18:56:14.000 UTC Qt::TimeSpec(LocalTime))
Jan 24 18:56:14 X42J kactivitymanagerd[798]: After the adjustment
Jan 24 18:56:14 X42J kactivitymanagerd[798]:      Current score :  0
Jan 24 18:56:14 X42J kactivitymanagerd[798]:       First update :  QDateTime(2017-01-24 18:56:14.913 UTC Qt::TimeSpec(LocalTime))
Jan 24 18:56:14 X42J kactivitymanagerd[798]:        Last update :  QDateTime(2017-01-24 18:56:14.000 UTC Qt::TimeSpec(LocalTime))
Jan 24 18:56:14 X42J kactivitymanagerd[798]:          New score :  0
Jan 24 18:56:18 X42J dbus-daemon[677]: Activating via systemd: service name='org.a11y.Bus' unit='at-spi-dbus-bus.service'
Jan 24 18:56:18 X42J systemd[651]: Starting Accessibility services bus...
Jan 24 18:56:18 X42J dbus-daemon[677]: Successfully activated service 'org.a11y.Bus'
Jan 24 18:56:18 X42J systemd[651]: Started Accessibility services bus.
Jan 24 18:56:42 X42J kwin_x11[758]: QXcbConnection: XCB error: 3 (BadWindow), sequence: 12355, resource id: 35651769, major code: 18 (ChangeProperty), minor code: 0
Jan 24 18:56:43 X42J kactivitymanagerd[798]: Creating the cache for:  "applications:xterm.desktop"
Jan 24 18:56:43 X42J kactivitymanagerd[798]: Already in database?  true
Jan 24 18:56:43 X42J kactivitymanagerd[798]:       First update :  QDateTime(2017-01-24 18:40:52.000 UTC Qt::TimeSpec(LocalTime))

Some lines are not complete because my scree can not show the entire line.

Offline

#2953 2017-01-24 20:07:23

horsemanoffaith
Member
Registered: 2013-05-10
Posts: 181

Re: Progress on Unity under Arch Linux!

Everything in your journalctl looks like it's loading KDE and not Unity. I'm not seeing any Unity startup files.

I recently updated gtk3-ubuntu in the AUR. It should build correctly. It's at version 3.22.7. My Github page is located here: https://github.com/horsemanoffaith/Unity-for-Arch
It's not fully updated- I need to update quite a few files on it, and I haven't had much time to do so lately. I can drop you a line here when I'm done updating it. Make SURE to follow the build order as some later packages depend on some of the packages earlier in the build.

Offline

#2954 2017-01-24 22:49:45

TristeShine
Member
From: France
Registered: 2016-10-23
Posts: 12

Re: Progress on Unity under Arch Linux!

horsemanoffaith wrote:

Everything in your journalctl looks like it's loading KDE and not Unity. I'm not seeing any Unity startup files.

I recently updated gtk3-ubuntu in the AUR. It should build correctly. It's at version 3.22.7. My Github page is located here: https://github.com/horsemanoffaith/Unity-for-Arch
It's not fully updated- I need to update quite a few files on it, and I haven't had much time to do so lately. I can drop you a line here when I'm done updating it. Make SURE to follow the build order as some later packages depend on some of the packages earlier in the build.

I could choose form Plasma and Unity when I tried to login the desktop environment. I tried first Unity, after entering the password, the screen got dark, and after one second, the login page returned. And then I logged in Plasma and got the journalctl.

Again, thanks a lot for your help. I will try your github repository this time.

Last edited by TristeShine (2017-01-24 22:51:16)

Offline

#2955 2017-02-15 22:25:11

tydell
Member
From: actually: Hannover, DE
Registered: 2009-07-26
Posts: 109
Website

Re: Progress on Unity under Arch Linux!

How it looks like today ? Is there any repo with current pkgbuilds that I can compile myself ?

Offline

#2956 2017-02-16 03:09:48

horsemanoffaith
Member
Registered: 2013-05-10
Posts: 181

Re: Progress on Unity under Arch Linux!

tydell wrote:

How it looks like today ? Is there any repo with current pkgbuilds that I can compile myself ?

I haven't updated my Github page for a bit because I just haven't had the time to do so. You might be able to build Unity and get it working off my Github page, but I know there are packages on there that are recently updated and some that haven't been updated for a while. You can try my Github page, but more than likely at the moment Chenxiaolong's page is probably more updated. Mine is at github.com/horsemanoffaith/Unity-for-Arch. Chenxiaolong's is at github.com/chenxiaolong/Unity-for-Arch. My github page is intended to eventually make it's way into the AUR. Chenxiaolong's PKGBUILDs do not meet the AUR package build requirements, and there are SOME difference between my packages and his. Right now Unity isn't working, but I think it's a minor issue... one of the library files updated, so I probably need to rebuild Compiz (which I'm in the process of doing). When I have time to update all my Github packages, I will be doing so. Once I get them stable, I will more than likely start moving them into the AUR.

Update: Compiz rebuild solved the problem... Unity is working again! smile

Last edited by horsemanoffaith (2017-02-16 03:14:52)

Offline

#2957 2017-02-16 15:30:58

tydell
Member
From: actually: Hannover, DE
Registered: 2009-07-26
Posts: 109
Website

Re: Progress on Unity under Arch Linux!

Thanks a lot. I see that Chenxiaolong's repo doesn't exist anymore still exist. I had 404 error but don't know why. I compiled yesterday packages from yours but I got black desktop with cursor, so I think I will compile it one more time today but first will look for newer packages and other changes.

Last edited by tydell (2017-02-16 21:28:57)

Offline

#2958 2017-02-16 18:56:58

horsemanoffaith
Member
Registered: 2013-05-10
Posts: 181

Re: Progress on Unity under Arch Linux!

tydell wrote:

Thanks a lot. I see that Chenxiaolong's repo doesn't exist anymore. I compiled yesterday packages from yours but I got black desktop with cursor, so I think I will compile it one more time today but first will look for newer packages and other changes.


Does it go black for a few seconds and then go back to the greeter? If it does, post your journalctl. I may know what's causing it and be able to give you a quick fix.

Offline

#2959 2017-02-16 20:46:47

tydell
Member
From: actually: Hannover, DE
Registered: 2009-07-26
Posts: 109
Website

Re: Progress on Unity under Arch Linux!

Exactly, it looks like this. Journalctl gives me only that bamfdaemon.service didn't start.

lut 16 21:43:47 probook4530s systemd[674]: bamfdaemon.service: Unit entered failed state.
lut 16 21:43:47 probook4530s systemd[674]: bamfdaemon.service: Failed with result 'exit-code'.
lut 16 21:43:47 probook4530s systemd[674]: bamfdaemon.service: Service hold-off time over, scheduling restart.
lut 16 21:43:47 probook4530s systemd[674]: Stopped BAMF Application Matcher Framework.
-- Subject: Ukończono wyłączanie jednostki UNIT
-- Defined-By: systemd
-- Support: http://lists.freedesktop.org/mailman/listinfo/systemd-devel
-- 
-- Jednostka UNIT ukończyła wyłączanie.
lut 16 21:43:47 probook4530s systemd[674]: bamfdaemon.service: Start request repeated too quickly.
lut 16 21:43:47 probook4530s systemd[674]: Failed to start BAMF Application Matcher Framework.
-- Subject: Jednostka UNIT się nie powiodła
-- Defined-By: systemd
-- Support: http://lists.freedesktop.org/mailman/listinfo/systemd-devel
-- 
-- Jednostka UNIT się nie powiodła.
-- 
-- Wynik: failed.
lut 16 21:43:47 probook4530s systemd[674]: bamfdaemon.service: Unit entered failed state.
lut 16 21:43:47 probook4530s systemd[674]: bamfdaemon.service: Failed with result 'exit-code'.

Offline

#2960 2017-02-19 16:10:20

horsemanoffaith
Member
Registered: 2013-05-10
Posts: 181

Re: Progress on Unity under Arch Linux!

tydell wrote:

Exactly, it looks like this. Journalctl gives me only that bamfdaemon.service didn't start.

lut 16 21:43:47 probook4530s systemd[674]: bamfdaemon.service: Unit entered failed state.
lut 16 21:43:47 probook4530s systemd[674]: bamfdaemon.service: Failed with result 'exit-code'.
lut 16 21:43:47 probook4530s systemd[674]: bamfdaemon.service: Service hold-off time over, scheduling restart.
lut 16 21:43:47 probook4530s systemd[674]: Stopped BAMF Application Matcher Framework.
-- Subject: Ukończono wyłączanie jednostki UNIT
-- Defined-By: systemd
-- Support: http://lists.freedesktop.org/mailman/listinfo/systemd-devel
-- 
-- Jednostka UNIT ukończyła wyłączanie.
lut 16 21:43:47 probook4530s systemd[674]: bamfdaemon.service: Start request repeated too quickly.
lut 16 21:43:47 probook4530s systemd[674]: Failed to start BAMF Application Matcher Framework.
-- Subject: Jednostka UNIT się nie powiodła
-- Defined-By: systemd
-- Support: http://lists.freedesktop.org/mailman/listinfo/systemd-devel
-- 
-- Jednostka UNIT się nie powiodła.
-- 
-- Wynik: failed.
lut 16 21:43:47 probook4530s systemd[674]: bamfdaemon.service: Unit entered failed state.
lut 16 21:43:47 probook4530s systemd[674]: bamfdaemon.service: Failed with result 'exit-code'.

Strange. I have not had any issues with bamfdaemon. I just built all the new packages available (minus one because it causes a problem that is occuring both on my laptop and my desktop), and they are all working on my system. I'll try to get all my packages updated on my Github page so that you can do a fresh build. There will be a package added and about 15 packages updated to new versions.

Offline

#2961 2017-02-19 23:09:38

burningcherry
Member
Registered: 2017-02-12
Posts: 2

Re: Progress on Unity under Arch Linux!

Hi everyone,

I have a problem with appmenu-qt: build fails on Qt macros.

Crucial part:

[ 57%] Building CXX object src/CMakeFiles/appmenu-qt.dir/appmenuplatformmenubar.cpp.o
In file included from /home/piotr/Pulpit/appmenu-qt/src/appmenu-qt-0.2.7+14.04.20140305/src/appmenuplatformmenubar.cpp:17:0:
/home/piotr/Pulpit/appmenu-qt/src/appmenu-qt-0.2.7+14.04.20140305/src/appmenuplatformmenubar.h:84:50: error: expected initializer before ‘:’ token
 class Q_GUI_EXPORT AppMenuPlatformMenuBarFactory : public QObject, public QPlatformMenuBarFactoryInterface
                                                  ^
In file included from /usr/include/qt/QtCore/qglobal.h:97:0,
                 from /usr/include/qt/QtCore/qnamespace.h:43,
                 from /usr/include/qt/QtCore/qobjectdefs.h:48,
                 from /usr/include/qt/QtCore/qobject.h:46,
                 from /usr/include/qt/QtCore/QObject:1,
                 from /home/piotr/Pulpit/appmenu-qt/src/appmenu-qt-0.2.7+14.04.20140305/src/appmenuplatformmenubar.h:20,
                 from /home/piotr/Pulpit/appmenu-qt/src/appmenu-qt-0.2.7+14.04.20140305/src/appmenuplatformmenubar.cpp:17:
/home/piotr/Pulpit/appmenu-qt/src/appmenu-qt-0.2.7+14.04.20140305/src/appmenuplatformmenubar.h:86:5: error: expected declaration before end of line
     Q_OBJECT
     ^
make[2]: *** [src/CMakeFiles/appmenu-qt.dir/build.make:74: src/CMakeFiles/appmenu-qt.dir/appmenuplatformmenubar.cpp.o] Błąd 1
make[1]: *** [CMakeFiles/Makefile2:151: src/CMakeFiles/appmenu-qt.dir/all] Błąd 2
make: *** [Makefile:128: all] Błąd 2
==> BŁĄD: Wystąpił błąd w build().
    Przerywam...
piotr@MareckiV:~/Pulpit/appmenu-qt$

Full output:

piotr@MareckiV:~/Pulpit$ cd appmenu-qt/
piotr@MareckiV:~/Pulpit/appmenu-qt$ makepkg -sci
==> Tworzę pakiet: appmenu-qt 0.2.7.14.04.20140305-1 (pon, 20 lut 2017, 00:02:08 CET)
==> Sprawdzanie zależności potrzebnych do uruchomienia...
==> Sprawdzanie zależności potrzebnych do budowy...
==> Pobieranie źródeł...
  -> Pobieram appmenu-qt_0.2.7+14.04.20140305.orig.tar.gz...
  % Total    % Received % Xferd  Average Speed   Time    Time     Time  Current
                                 Dload  Upload   Total   Spent    Left  Speed
  0     0    0     0    0     0      0      0 --:--:-- --:--:-- --:--:  0     0    0     0    0     0      0      0 --:--:-- --:--:-- --:--:  0     0    0     0    0     0      0      0 --:--:-- --:--:-- --:--:--     0
100 27625  100 27625    0     0  24827      0  0:00:01  0:00:01 --:--:-- 24827
==> Sprawdzam pliki source za pomocą sha512sums...
    appmenu-qt_0.2.7+14.04.20140305.orig.tar.gz ... Zgadza się
==> Rozpakowywanie źródeł...
  -> Rozpakowywanie appmenu-qt_0.2.7+14.04.20140305.orig.tar.gz za pomocą bsdtar
==> Zaczynam build()...
-- The C compiler identification is GNU 6.3.1
-- The CXX compiler identification is GNU 6.3.1
-- Check for working C compiler: /usr/bin/cc
-- Check for working C compiler: /usr/bin/cc -- works
-- Detecting C compiler ABI info
-- Detecting C compiler ABI info - done
-- Detecting C compile features
-- Detecting C compile features - done
-- Check for working CXX compiler: /usr/bin/c++
-- Check for working CXX compiler: /usr/bin/c++ -- works
-- Detecting CXX compiler ABI info
-- Detecting CXX compiler ABI info - done
-- Detecting CXX compile features
-- Detecting CXX compile features - done
-- Autodetecting Qt version to use
-- Found PkgConfig: /usr/bin/pkg-config (found version "0.29.1") 
-- Checking for module 'dbusmenu-qt5>=0.9.0'
--   Found dbusmenu-qt5, version 0.9.2
-- Configuring done
-- Generating done
-- Build files have been written to: /home/piotr/Pulpit/appmenu-qt/src/appmenu-qt-0.2.7+14.04.20140305
Scanning dependencies of target appmenu-qt_automoc
[ 14%] Automatic moc for target appmenu-qt
Generating moc source appmenuplatformmenubar.moc
/home/piotr/Pulpit/appmenu-qt/src/appmenu-qt-0.2.7+14.04.20140305/src/appmenuplatformmenubar.cpp:0: Note: No relevant classes found. No output generated.
Generating moc source appmenu-qt_automoc.dir/moc_appmenuplatfor_IITJHTJCMBIPB6.cpp
Generating moc compilation appmenu-qt_automoc.cpp
[ 14%] Built target appmenu-qt_automoc
[ 28%] Generating registrar.cpp, registrar.h
[ 42%] Generating registrar.moc
Scanning dependencies of target appmenu-qt
[ 57%] Building CXX object src/CMakeFiles/appmenu-qt.dir/appmenuplatformmenubar.cpp.o
In file included from /home/piotr/Pulpit/appmenu-qt/src/appmenu-qt-0.2.7+14.04.20140305/src/appmenuplatformmenubar.cpp:17:0:
/home/piotr/Pulpit/appmenu-qt/src/appmenu-qt-0.2.7+14.04.20140305/src/appmenuplatformmenubar.h:84:50: error: expected initializer before ‘:’ token
 class Q_GUI_EXPORT AppMenuPlatformMenuBarFactory : public QObject, public QPlatformMenuBarFactoryInterface
                                                  ^
In file included from /usr/include/qt/QtCore/qglobal.h:97:0,
                 from /usr/include/qt/QtCore/qnamespace.h:43,
                 from /usr/include/qt/QtCore/qobjectdefs.h:48,
                 from /usr/include/qt/QtCore/qobject.h:46,
                 from /usr/include/qt/QtCore/QObject:1,
                 from /home/piotr/Pulpit/appmenu-qt/src/appmenu-qt-0.2.7+14.04.20140305/src/appmenuplatformmenubar.h:20,
                 from /home/piotr/Pulpit/appmenu-qt/src/appmenu-qt-0.2.7+14.04.20140305/src/appmenuplatformmenubar.cpp:17:
/home/piotr/Pulpit/appmenu-qt/src/appmenu-qt-0.2.7+14.04.20140305/src/appmenuplatformmenubar.h:86:5: error: expected declaration before end of line
     Q_OBJECT
     ^
make[2]: *** [src/CMakeFiles/appmenu-qt.dir/build.make:74: src/CMakeFiles/appmenu-qt.dir/appmenuplatformmenubar.cpp.o] Błąd 1
make[1]: *** [CMakeFiles/Makefile2:151: src/CMakeFiles/appmenu-qt.dir/all] Błąd 2
make: *** [Makefile:128: all] Błąd 2
==> BŁĄD: Wystąpił błąd w build().
    Przerywam...
piotr@MareckiV:~/Pulpit/appmenu-qt$

I'm using the newest version of testing branch from Github. Arch, qt5-base, qt4 and cmake-extras are fully updated, 'What can I update?' doesn't show anything except not installed appmenu-qt.

What should I do and why?

Last edited by burningcherry (2017-02-19 23:14:59)

Offline

#2962 2017-02-19 23:45:06

horsemanoffaith
Member
Registered: 2013-05-10
Posts: 181

Re: Progress on Unity under Arch Linux!

burningcherry wrote:

Hi everyone,

I have a problem with appmenu-qt: build fails on Qt macros.

Crucial part:

[ 57%] Building CXX object src/CMakeFiles/appmenu-qt.dir/appmenuplatformmenubar.cpp.o
In file included from /home/piotr/Pulpit/appmenu-qt/src/appmenu-qt-0.2.7+14.04.20140305/src/appmenuplatformmenubar.cpp:17:0:
/home/piotr/Pulpit/appmenu-qt/src/appmenu-qt-0.2.7+14.04.20140305/src/appmenuplatformmenubar.h:84:50: error: expected initializer before ‘:’ token
 class Q_GUI_EXPORT AppMenuPlatformMenuBarFactory : public QObject, public QPlatformMenuBarFactoryInterface
                                                  ^
In file included from /usr/include/qt/QtCore/qglobal.h:97:0,
                 from /usr/include/qt/QtCore/qnamespace.h:43,
                 from /usr/include/qt/QtCore/qobjectdefs.h:48,
                 from /usr/include/qt/QtCore/qobject.h:46,
                 from /usr/include/qt/QtCore/QObject:1,
                 from /home/piotr/Pulpit/appmenu-qt/src/appmenu-qt-0.2.7+14.04.20140305/src/appmenuplatformmenubar.h:20,
                 from /home/piotr/Pulpit/appmenu-qt/src/appmenu-qt-0.2.7+14.04.20140305/src/appmenuplatformmenubar.cpp:17:
/home/piotr/Pulpit/appmenu-qt/src/appmenu-qt-0.2.7+14.04.20140305/src/appmenuplatformmenubar.h:86:5: error: expected declaration before end of line
     Q_OBJECT
     ^
make[2]: *** [src/CMakeFiles/appmenu-qt.dir/build.make:74: src/CMakeFiles/appmenu-qt.dir/appmenuplatformmenubar.cpp.o] Błąd 1
make[1]: *** [CMakeFiles/Makefile2:151: src/CMakeFiles/appmenu-qt.dir/all] Błąd 2
make: *** [Makefile:128: all] Błąd 2
==> BŁĄD: Wystąpił błąd w build().
    Przerywam...
piotr@MareckiV:~/Pulpit/appmenu-qt$

Full output:

piotr@MareckiV:~/Pulpit$ cd appmenu-qt/
piotr@MareckiV:~/Pulpit/appmenu-qt$ makepkg -sci
==> Tworzę pakiet: appmenu-qt 0.2.7.14.04.20140305-1 (pon, 20 lut 2017, 00:02:08 CET)
==> Sprawdzanie zależności potrzebnych do uruchomienia...
==> Sprawdzanie zależności potrzebnych do budowy...
==> Pobieranie źródeł...
  -> Pobieram appmenu-qt_0.2.7+14.04.20140305.orig.tar.gz...
  % Total    % Received % Xferd  Average Speed   Time    Time     Time  Current
                                 Dload  Upload   Total   Spent    Left  Speed
  0     0    0     0    0     0      0      0 --:--:-- --:--:-- --:--:  0     0    0     0    0     0      0      0 --:--:-- --:--:-- --:--:  0     0    0     0    0     0      0      0 --:--:-- --:--:-- --:--:--     0
100 27625  100 27625    0     0  24827      0  0:00:01  0:00:01 --:--:-- 24827
==> Sprawdzam pliki source za pomocą sha512sums...
    appmenu-qt_0.2.7+14.04.20140305.orig.tar.gz ... Zgadza się
==> Rozpakowywanie źródeł...
  -> Rozpakowywanie appmenu-qt_0.2.7+14.04.20140305.orig.tar.gz za pomocą bsdtar
==> Zaczynam build()...
-- The C compiler identification is GNU 6.3.1
-- The CXX compiler identification is GNU 6.3.1
-- Check for working C compiler: /usr/bin/cc
-- Check for working C compiler: /usr/bin/cc -- works
-- Detecting C compiler ABI info
-- Detecting C compiler ABI info - done
-- Detecting C compile features
-- Detecting C compile features - done
-- Check for working CXX compiler: /usr/bin/c++
-- Check for working CXX compiler: /usr/bin/c++ -- works
-- Detecting CXX compiler ABI info
-- Detecting CXX compiler ABI info - done
-- Detecting CXX compile features
-- Detecting CXX compile features - done
-- Autodetecting Qt version to use
-- Found PkgConfig: /usr/bin/pkg-config (found version "0.29.1") 
-- Checking for module 'dbusmenu-qt5>=0.9.0'
--   Found dbusmenu-qt5, version 0.9.2
-- Configuring done
-- Generating done
-- Build files have been written to: /home/piotr/Pulpit/appmenu-qt/src/appmenu-qt-0.2.7+14.04.20140305
Scanning dependencies of target appmenu-qt_automoc
[ 14%] Automatic moc for target appmenu-qt
Generating moc source appmenuplatformmenubar.moc
/home/piotr/Pulpit/appmenu-qt/src/appmenu-qt-0.2.7+14.04.20140305/src/appmenuplatformmenubar.cpp:0: Note: No relevant classes found. No output generated.
Generating moc source appmenu-qt_automoc.dir/moc_appmenuplatfor_IITJHTJCMBIPB6.cpp
Generating moc compilation appmenu-qt_automoc.cpp
[ 14%] Built target appmenu-qt_automoc
[ 28%] Generating registrar.cpp, registrar.h
[ 42%] Generating registrar.moc
Scanning dependencies of target appmenu-qt
[ 57%] Building CXX object src/CMakeFiles/appmenu-qt.dir/appmenuplatformmenubar.cpp.o
In file included from /home/piotr/Pulpit/appmenu-qt/src/appmenu-qt-0.2.7+14.04.20140305/src/appmenuplatformmenubar.cpp:17:0:
/home/piotr/Pulpit/appmenu-qt/src/appmenu-qt-0.2.7+14.04.20140305/src/appmenuplatformmenubar.h:84:50: error: expected initializer before ‘:’ token
 class Q_GUI_EXPORT AppMenuPlatformMenuBarFactory : public QObject, public QPlatformMenuBarFactoryInterface
                                                  ^
In file included from /usr/include/qt/QtCore/qglobal.h:97:0,
                 from /usr/include/qt/QtCore/qnamespace.h:43,
                 from /usr/include/qt/QtCore/qobjectdefs.h:48,
                 from /usr/include/qt/QtCore/qobject.h:46,
                 from /usr/include/qt/QtCore/QObject:1,
                 from /home/piotr/Pulpit/appmenu-qt/src/appmenu-qt-0.2.7+14.04.20140305/src/appmenuplatformmenubar.h:20,
                 from /home/piotr/Pulpit/appmenu-qt/src/appmenu-qt-0.2.7+14.04.20140305/src/appmenuplatformmenubar.cpp:17:
/home/piotr/Pulpit/appmenu-qt/src/appmenu-qt-0.2.7+14.04.20140305/src/appmenuplatformmenubar.h:86:5: error: expected declaration before end of line
     Q_OBJECT
     ^
make[2]: *** [src/CMakeFiles/appmenu-qt.dir/build.make:74: src/CMakeFiles/appmenu-qt.dir/appmenuplatformmenubar.cpp.o] Błąd 1
make[1]: *** [CMakeFiles/Makefile2:151: src/CMakeFiles/appmenu-qt.dir/all] Błąd 2
make: *** [Makefile:128: all] Błąd 2
==> BŁĄD: Wystąpił błąd w build().
    Przerywam...
piotr@MareckiV:~/Pulpit/appmenu-qt$

I'm using the newest version of testing branch from Github. Arch, qt5-base, qt4 and cmake-extras are fully updated, 'What can I update?' doesn't show anything except not installed appmenu-qt.

What should I do and why?

Looking at Launchpad, this package hasn't been updated in quite some time (almost 3 years). It may not even be necessary. My build fails with the same issue. I don't have the same gift of writing code as Chenxiaolong does, so I wouldn't be able to help you there. I'd file an issue on his github page and see if he can figure out a workaround. I just removed appmenu-qt4 and appmenu-qt5 off my system to see if anything major happens. I'll let you know if I see anything.

Update- I ran through all the programs that I have installed, and the only one that doesn't show up on the menu bar is Banshee, but it didn't show up even when I had appmenu-qt4 installed. If you use qt4 applications, you might want appmenu-qt, but if you don't you can probably skip it.

Last edited by horsemanoffaith (2017-02-20 00:21:14)

Offline

#2963 2017-02-21 04:06:42

burningcherry
Member
Registered: 2017-02-12
Posts: 2

Re: Progress on Unity under Arch Linux!

OK, I think I've pasażer it... od there any current solution for

no module Mamed xdg.BaseDirectory

issue? Installing

pyxdg

doesn't work. Basically, Unity is starting, but every window, label, etc. move leaves artifacts. I've tried to just run

$ unity

in terminal and it shows the problem mentioned above.

Offline

#2964 2017-02-21 17:59:58

tydell
Member
From: actually: Hannover, DE
Registered: 2009-07-26
Posts: 109
Website

Re: Progress on Unity under Arch Linux!

Ok. I got unity working but couldn't build indicator-datetime. It fails when need to patch.

==> Tworzę pakiet: indicator-datetime 15.10.17.04.20170210-1 (wto, 21 lut 2017, 18:52:24 CET)
==> Sprawdzanie zależności potrzebnych do uruchomienia...
==> Sprawdzanie zależności potrzebnych do budowy...
==> Pobieranie źródeł...
  -> Znaleziono indicator-datetime_15.10+17.04.20170210.orig.tar.gz
  -> Znaleziono 0001-Not-a-phone.patch
  -> Znaleziono 0002-Disable-tests.patch
==> Sprawdzam pliki source za pomocą sha512sums...
    indicator-datetime_15.10+17.04.20170210.orig.tar.gz ... Zgadza się
    0001-Not-a-phone.patch ... Zgadza się
    0002-Disable-tests.patch ... Zgadza się
==> Usuwanie istniejącego katalogu $srcdir/...
==> Rozpakowywanie źródeł...
  -> Rozpakowywanie indicator-datetime_15.10+17.04.20170210.orig.tar.gz za pomocą bsdtar
==> Zaczynam prepare()...
patching file CMakeLists.txt
Hunk #1 succeeded at 48 (offset 2 lines).
patching file include/datetime/actions-live.h
patching file src/actions-live.cpp
Hunk #3 FAILED at 87.
1 out of 6 hunks FAILED -- saving rejects to file src/actions-live.cpp.rej
patching file src/notifications.cpp
Hunk #2 FAILED at 458.
1 out of 2 hunks FAILED -- saving rejects to file src/notifications.cpp.rej
patching file tests/test-live-actions.cpp

So i got working unitu desktop but have no of indicators on panel.

I can see also that unity package depends on packages that not every of it we can install from AUR (libgnomeui, libbonobo etc). In my opinion the easiest way to install them is to use downgrade.

Offline

#2965 2017-02-23 04:23:49

horsemanoffaith
Member
Registered: 2013-05-10
Posts: 181

Re: Progress on Unity under Arch Linux!

I thought I had Unity working correctly after all the updates that I did but unfortunately I am now having issues with Unity not starting. I'm not exactly sure where the problem lies, but I see that compiz tries to start, but ends up segfaulting. Rebuilding compiz does no good. I'll work on it to see if I can figure out the problem and get it fixed.

Offline

#2966 2017-09-03 04:47:22

ibones
Member
Registered: 2016-10-08
Posts: 11

Re: Progress on Unity under Arch Linux!

tydell wrote:

Ok. I got unity working but couldn't build indicator-datetime. It fails when need to patch.

==> Tworzę pakiet: indicator-datetime 15.10.17.04.20170210-1 (wto, 21 lut 2017, 18:52:24 CET)
==> Sprawdzanie zależności potrzebnych do uruchomienia...
==> Sprawdzanie zależności potrzebnych do budowy...
==> Pobieranie źródeł...
  -> Znaleziono indicator-datetime_15.10+17.04.20170210.orig.tar.gz
  -> Znaleziono 0001-Not-a-phone.patch
  -> Znaleziono 0002-Disable-tests.patch
==> Sprawdzam pliki source za pomocą sha512sums...
    indicator-datetime_15.10+17.04.20170210.orig.tar.gz ... Zgadza się
    0001-Not-a-phone.patch ... Zgadza się
    0002-Disable-tests.patch ... Zgadza się
==> Usuwanie istniejącego katalogu $srcdir/...
==> Rozpakowywanie źródeł...
  -> Rozpakowywanie indicator-datetime_15.10+17.04.20170210.orig.tar.gz za pomocą bsdtar
==> Zaczynam prepare()...
patching file CMakeLists.txt
Hunk #1 succeeded at 48 (offset 2 lines).
patching file include/datetime/actions-live.h
patching file src/actions-live.cpp
Hunk #3 FAILED at 87.
1 out of 6 hunks FAILED -- saving rejects to file src/actions-live.cpp.rej
patching file src/notifications.cpp
Hunk #2 FAILED at 458.
1 out of 2 hunks FAILED -- saving rejects to file src/notifications.cpp.rej
patching file tests/test-live-actions.cpp

So i got working unitu desktop but have no of indicators on panel.

I can see also that unity package depends on packages that not every of it we can install from AUR (libgnomeui, libbonobo etc). In my opinion the easiest way to install them is to use downgrade.

Do you find a solution for the indicators problem?

Last edited by ibones (2017-09-03 06:22:29)

Offline

#2967 2017-09-10 03:04:53

quequotion
Member
From: Oita, Japan
Registered: 2013-07-29
Posts: 712
Website

Re: Progress on Unity under Arch Linux!

horsemanoffaith wrote:

compiz tries to start, but ends up segfaulting. Rebuilding compiz does no good

I always have this problem unless I build compiz in a clean chroot. I'd really like to get to the bottom of it; some package gets involved that doesn't break compilation but does build a non-functional compiz. The only way around it seems to be building compiz in a clean chroot (for now).

Last edited by quequotion (2017-09-10 03:05:37)

Offline

Board footer

Powered by FluxBB