You are not logged in.

#951 2012-09-10 23:22:56

aabmass
Member
Registered: 2011-12-14
Posts: 34

Re: Progress on Unity under Arch Linux!

I'm having problems building gnome-control-center now. Output is:

  CCLD     libonline-accounts.la
  ITMRG  gnome-online-accounts-panel.desktop
make[4]: Leaving directory `/home/aaron/builds/unity/Unity-for-Arch/gnome-control-center-ubuntu/src/gnome-control-center-3.4.2/panels/online-accounts'
make[3]: Leaving directory `/home/aaron/builds/unity/Unity-for-Arch/gnome-control-center-ubuntu/src/gnome-control-center-3.4.2/panels/online-accounts'
Making all in region
make[3]: Entering directory `/home/aaron/builds/unity/Unity-for-Arch/gnome-control-center-ubuntu/src/gnome-control-center-3.4.2/panels/region'
  CC       region-module.lo
  CC       cc-region-panel.lo
  CC       gnome-region-panel-formats.lo
  CC       gnome-region-panel-lang.lo
  CC       gnome-region-panel-system.lo
  CC       gnome-region-panel-xkb.lo
  CC       gnome-region-panel-xkblt.lo
  CC       gnome-region-panel-xkbltadd.lo
  CC       gnome-region-panel-xkbot.lo
  CC       gnome-region-panel-xkbpv.lo
  CCLD     libregion.la
  ITMRG  gnome-region-panel.desktop
make[3]: Leaving directory `/home/aaron/builds/unity/Unity-for-Arch/gnome-control-center-ubuntu/src/gnome-control-center-3.4.2/panels/region'
Making all in info
make[3]: Entering directory `/home/aaron/builds/unity/Unity-for-Arch/gnome-control-center-ubuntu/src/gnome-control-center-3.4.2/panels/info'
  CC       info-module.lo
  CC       cc-info-panel.lo
cc-info-panel.c: In function 'default_app_changed':
cc-info-panel.c:934:18: warning: assignment makes pointer from integer without a cast [enabled by default]
  CC       hostname-helper.lo
  CC       gsd-disk-space-helper.lo
  CCLD     libinfo.la
  CC       test_hostname-hostname-helper.o
  CC       test_hostname-test-hostname.o
  CCLD     test-hostname
  ITMRG  gnome-info-panel.desktop
./test-hostname ./hostnames-test.txt > /dev/null
make[3]: Leaving directory `/home/aaron/builds/unity/Unity-for-Arch/gnome-control-center-ubuntu/src/gnome-control-center-3.4.2/panels/info'
Making all in sound
make[3]: Entering directory `/home/aaron/builds/unity/Unity-for-Arch/gnome-control-center-ubuntu/src/gnome-control-center-3.4.2/panels/sound'
make  all-recursive
make[4]: Entering directory `/home/aaron/builds/unity/Unity-for-Arch/gnome-control-center-ubuntu/src/gnome-control-center-3.4.2/panels/sound'
Making all in data
make[5]: Entering directory `/home/aaron/builds/unity/Unity-for-Arch/gnome-control-center-ubuntu/src/gnome-control-center-3.4.2/panels/sound/data'
Making all in icons
make[6]: Entering directory `/home/aaron/builds/unity/Unity-for-Arch/gnome-control-center-ubuntu/src/gnome-control-center-3.4.2/panels/sound/data/icons'
Making all in scalable
make[7]: Entering directory `/home/aaron/builds/unity/Unity-for-Arch/gnome-control-center-ubuntu/src/gnome-control-center-3.4.2/panels/sound/data/icons/scalable'
Making all in apps
make[8]: Entering directory `/home/aaron/builds/unity/Unity-for-Arch/gnome-control-center-ubuntu/src/gnome-control-center-3.4.2/panels/sound/data/icons/scalable/apps'
make[8]: Nothing to be done for `all'.
make[8]: Leaving directory `/home/aaron/builds/unity/Unity-for-Arch/gnome-control-center-ubuntu/src/gnome-control-center-3.4.2/panels/sound/data/icons/scalable/apps'
Making all in devices
make[8]: Entering directory `/home/aaron/builds/unity/Unity-for-Arch/gnome-control-center-ubuntu/src/gnome-control-center-3.4.2/panels/sound/data/icons/scalable/devices'
make[8]: Nothing to be done for `all'.
make[8]: Leaving directory `/home/aaron/builds/unity/Unity-for-Arch/gnome-control-center-ubuntu/src/gnome-control-center-3.4.2/panels/sound/data/icons/scalable/devices'
make[8]: Entering directory `/home/aaron/builds/unity/Unity-for-Arch/gnome-control-center-ubuntu/src/gnome-control-center-3.4.2/panels/sound/data/icons/scalable'
make[8]: Nothing to be done for `all-am'.
make[8]: Leaving directory `/home/aaron/builds/unity/Unity-for-Arch/gnome-control-center-ubuntu/src/gnome-control-center-3.4.2/panels/sound/data/icons/scalable'
make[7]: Leaving directory `/home/aaron/builds/unity/Unity-for-Arch/gnome-control-center-ubuntu/src/gnome-control-center-3.4.2/panels/sound/data/icons/scalable'
Making all in 16x16
make[7]: Entering directory `/home/aaron/builds/unity/Unity-for-Arch/gnome-control-center-ubuntu/src/gnome-control-center-3.4.2/panels/sound/data/icons/16x16'
Making all in status
make[8]: Entering directory `/home/aaron/builds/unity/Unity-for-Arch/gnome-control-center-ubuntu/src/gnome-control-center-3.4.2/panels/sound/data/icons/16x16/status'
make[8]: Nothing to be done for `all'.
make[8]: Leaving directory `/home/aaron/builds/unity/Unity-for-Arch/gnome-control-center-ubuntu/src/gnome-control-center-3.4.2/panels/sound/data/icons/16x16/status'
Making all in apps
make[8]: Entering directory `/home/aaron/builds/unity/Unity-for-Arch/gnome-control-center-ubuntu/src/gnome-control-center-3.4.2/panels/sound/data/icons/16x16/apps'
make[8]: Nothing to be done for `all'.
make[8]: Leaving directory `/home/aaron/builds/unity/Unity-for-Arch/gnome-control-center-ubuntu/src/gnome-control-center-3.4.2/panels/sound/data/icons/16x16/apps'
Making all in devices
make[8]: Entering directory `/home/aaron/builds/unity/Unity-for-Arch/gnome-control-center-ubuntu/src/gnome-control-center-3.4.2/panels/sound/data/icons/16x16/devices'
make[8]: Nothing to be done for `all'.
make[8]: Leaving directory `/home/aaron/builds/unity/Unity-for-Arch/gnome-control-center-ubuntu/src/gnome-control-center-3.4.2/panels/sound/data/icons/16x16/devices'
make[8]: Entering directory `/home/aaron/builds/unity/Unity-for-Arch/gnome-control-center-ubuntu/src/gnome-control-center-3.4.2/panels/sound/data/icons/16x16'
make[8]: Nothing to be done for `all-am'.
make[8]: Leaving directory `/home/aaron/builds/unity/Unity-for-Arch/gnome-control-center-ubuntu/src/gnome-control-center-3.4.2/panels/sound/data/icons/16x16'
make[7]: Leaving directory `/home/aaron/builds/unity/Unity-for-Arch/gnome-control-center-ubuntu/src/gnome-control-center-3.4.2/panels/sound/data/icons/16x16'
Making all in 22x22
make[7]: Entering directory `/home/aaron/builds/unity/Unity-for-Arch/gnome-control-center-ubuntu/src/gnome-control-center-3.4.2/panels/sound/data/icons/22x22'
Making all in status
make[8]: Entering directory `/home/aaron/builds/unity/Unity-for-Arch/gnome-control-center-ubuntu/src/gnome-control-center-3.4.2/panels/sound/data/icons/22x22/status'
make[8]: Nothing to be done for `all'.
make[8]: Leaving directory `/home/aaron/builds/unity/Unity-for-Arch/gnome-control-center-ubuntu/src/gnome-control-center-3.4.2/panels/sound/data/icons/22x22/status'
Making all in apps
make[8]: Entering directory `/home/aaron/builds/unity/Unity-for-Arch/gnome-control-center-ubuntu/src/gnome-control-center-3.4.2/panels/sound/data/icons/22x22/apps'
make[8]: Nothing to be done for `all'.
make[8]: Leaving directory `/home/aaron/builds/unity/Unity-for-Arch/gnome-control-center-ubuntu/src/gnome-control-center-3.4.2/panels/sound/data/icons/22x22/apps'
make[8]: Entering directory `/home/aaron/builds/unity/Unity-for-Arch/gnome-control-center-ubuntu/src/gnome-control-center-3.4.2/panels/sound/data/icons/22x22'
make[8]: Nothing to be done for `all-am'.
make[8]: Leaving directory `/home/aaron/builds/unity/Unity-for-Arch/gnome-control-center-ubuntu/src/gnome-control-center-3.4.2/panels/sound/data/icons/22x22'
make[7]: Leaving directory `/home/aaron/builds/unity/Unity-for-Arch/gnome-control-center-ubuntu/src/gnome-control-center-3.4.2/panels/sound/data/icons/22x22'
Making all in 24x24
make[7]: Entering directory `/home/aaron/builds/unity/Unity-for-Arch/gnome-control-center-ubuntu/src/gnome-control-center-3.4.2/panels/sound/data/icons/24x24'
Making all in status
make[8]: Entering directory `/home/aaron/builds/unity/Unity-for-Arch/gnome-control-center-ubuntu/src/gnome-control-center-3.4.2/panels/sound/data/icons/24x24/status'
make[8]: Nothing to be done for `all'.
make[8]: Leaving directory `/home/aaron/builds/unity/Unity-for-Arch/gnome-control-center-ubuntu/src/gnome-control-center-3.4.2/panels/sound/data/icons/24x24/status'
Making all in apps
make[8]: Entering directory `/home/aaron/builds/unity/Unity-for-Arch/gnome-control-center-ubuntu/src/gnome-control-center-3.4.2/panels/sound/data/icons/24x24/apps'
make[8]: Nothing to be done for `all'.
make[8]: Leaving directory `/home/aaron/builds/unity/Unity-for-Arch/gnome-control-center-ubuntu/src/gnome-control-center-3.4.2/panels/sound/data/icons/24x24/apps'
Making all in devices
make[8]: Entering directory `/home/aaron/builds/unity/Unity-for-Arch/gnome-control-center-ubuntu/src/gnome-control-center-3.4.2/panels/sound/data/icons/24x24/devices'
make[8]: Nothing to be done for `all'.
make[8]: Leaving directory `/home/aaron/builds/unity/Unity-for-Arch/gnome-control-center-ubuntu/src/gnome-control-center-3.4.2/panels/sound/data/icons/24x24/devices'
make[8]: Entering directory `/home/aaron/builds/unity/Unity-for-Arch/gnome-control-center-ubuntu/src/gnome-control-center-3.4.2/panels/sound/data/icons/24x24'
make[8]: Nothing to be done for `all-am'.
make[8]: Leaving directory `/home/aaron/builds/unity/Unity-for-Arch/gnome-control-center-ubuntu/src/gnome-control-center-3.4.2/panels/sound/data/icons/24x24'
make[7]: Leaving directory `/home/aaron/builds/unity/Unity-for-Arch/gnome-control-center-ubuntu/src/gnome-control-center-3.4.2/panels/sound/data/icons/24x24'
Making all in 32x32
make[7]: Entering directory `/home/aaron/builds/unity/Unity-for-Arch/gnome-control-center-ubuntu/src/gnome-control-center-3.4.2/panels/sound/data/icons/32x32'
Making all in status
make[8]: Entering directory `/home/aaron/builds/unity/Unity-for-Arch/gnome-control-center-ubuntu/src/gnome-control-center-3.4.2/panels/sound/data/icons/32x32/status'
make[8]: Nothing to be done for `all'.
make[8]: Leaving directory `/home/aaron/builds/unity/Unity-for-Arch/gnome-control-center-ubuntu/src/gnome-control-center-3.4.2/panels/sound/data/icons/32x32/status'
Making all in apps
make[8]: Entering directory `/home/aaron/builds/unity/Unity-for-Arch/gnome-control-center-ubuntu/src/gnome-control-center-3.4.2/panels/sound/data/icons/32x32/apps'
make[8]: Nothing to be done for `all'.
make[8]: Leaving directory `/home/aaron/builds/unity/Unity-for-Arch/gnome-control-center-ubuntu/src/gnome-control-center-3.4.2/panels/sound/data/icons/32x32/apps'
Making all in devices
make[8]: Entering directory `/home/aaron/builds/unity/Unity-for-Arch/gnome-control-center-ubuntu/src/gnome-control-center-3.4.2/panels/sound/data/icons/32x32/devices'
make[8]: Nothing to be done for `all'.
make[8]: Leaving directory `/home/aaron/builds/unity/Unity-for-Arch/gnome-control-center-ubuntu/src/gnome-control-center-3.4.2/panels/sound/data/icons/32x32/devices'
make[8]: Entering directory `/home/aaron/builds/unity/Unity-for-Arch/gnome-control-center-ubuntu/src/gnome-control-center-3.4.2/panels/sound/data/icons/32x32'
make[8]: Nothing to be done for `all-am'.
make[8]: Leaving directory `/home/aaron/builds/unity/Unity-for-Arch/gnome-control-center-ubuntu/src/gnome-control-center-3.4.2/panels/sound/data/icons/32x32'
make[7]: Leaving directory `/home/aaron/builds/unity/Unity-for-Arch/gnome-control-center-ubuntu/src/gnome-control-center-3.4.2/panels/sound/data/icons/32x32'
Making all in 48x48
make[7]: Entering directory `/home/aaron/builds/unity/Unity-for-Arch/gnome-control-center-ubuntu/src/gnome-control-center-3.4.2/panels/sound/data/icons/48x48'
Making all in apps
make[8]: Entering directory `/home/aaron/builds/unity/Unity-for-Arch/gnome-control-center-ubuntu/src/gnome-control-center-3.4.2/panels/sound/data/icons/48x48/apps'
make[8]: Nothing to be done for `all'.
make[8]: Leaving directory `/home/aaron/builds/unity/Unity-for-Arch/gnome-control-center-ubuntu/src/gnome-control-center-3.4.2/panels/sound/data/icons/48x48/apps'
Making all in devices
make[8]: Entering directory `/home/aaron/builds/unity/Unity-for-Arch/gnome-control-center-ubuntu/src/gnome-control-center-3.4.2/panels/sound/data/icons/48x48/devices'
make[8]: Nothing to be done for `all'.
make[8]: Leaving directory `/home/aaron/builds/unity/Unity-for-Arch/gnome-control-center-ubuntu/src/gnome-control-center-3.4.2/panels/sound/data/icons/48x48/devices'
make[8]: Entering directory `/home/aaron/builds/unity/Unity-for-Arch/gnome-control-center-ubuntu/src/gnome-control-center-3.4.2/panels/sound/data/icons/48x48'
make[8]: Nothing to be done for `all-am'.
make[8]: Leaving directory `/home/aaron/builds/unity/Unity-for-Arch/gnome-control-center-ubuntu/src/gnome-control-center-3.4.2/panels/sound/data/icons/48x48'
make[7]: Leaving directory `/home/aaron/builds/unity/Unity-for-Arch/gnome-control-center-ubuntu/src/gnome-control-center-3.4.2/panels/sound/data/icons/48x48'
make[7]: Entering directory `/home/aaron/builds/unity/Unity-for-Arch/gnome-control-center-ubuntu/src/gnome-control-center-3.4.2/panels/sound/data/icons'
make[7]: Nothing to be done for `all-am'.
make[7]: Leaving directory `/home/aaron/builds/unity/Unity-for-Arch/gnome-control-center-ubuntu/src/gnome-control-center-3.4.2/panels/sound/data/icons'
make[6]: Leaving directory `/home/aaron/builds/unity/Unity-for-Arch/gnome-control-center-ubuntu/src/gnome-control-center-3.4.2/panels/sound/data/icons'
Making all in symbolic-icons
make[6]: Entering directory `/home/aaron/builds/unity/Unity-for-Arch/gnome-control-center-ubuntu/src/gnome-control-center-3.4.2/panels/sound/data/symbolic-icons'
Making all in scalable
make[7]: Entering directory `/home/aaron/builds/unity/Unity-for-Arch/gnome-control-center-ubuntu/src/gnome-control-center-3.4.2/panels/sound/data/symbolic-icons/scalable'
Making all in status
make[8]: Entering directory `/home/aaron/builds/unity/Unity-for-Arch/gnome-control-center-ubuntu/src/gnome-control-center-3.4.2/panels/sound/data/symbolic-icons/scalable/status'
make[8]: Nothing to be done for `all'.
make[8]: Leaving directory `/home/aaron/builds/unity/Unity-for-Arch/gnome-control-center-ubuntu/src/gnome-control-center-3.4.2/panels/sound/data/symbolic-icons/scalable/status'
make[8]: Entering directory `/home/aaron/builds/unity/Unity-for-Arch/gnome-control-center-ubuntu/src/gnome-control-center-3.4.2/panels/sound/data/symbolic-icons/scalable'
make[8]: Nothing to be done for `all-am'.
make[8]: Leaving directory `/home/aaron/builds/unity/Unity-for-Arch/gnome-control-center-ubuntu/src/gnome-control-center-3.4.2/panels/sound/data/symbolic-icons/scalable'
make[7]: Leaving directory `/home/aaron/builds/unity/Unity-for-Arch/gnome-control-center-ubuntu/src/gnome-control-center-3.4.2/panels/sound/data/symbolic-icons/scalable'
make[7]: Entering directory `/home/aaron/builds/unity/Unity-for-Arch/gnome-control-center-ubuntu/src/gnome-control-center-3.4.2/panels/sound/data/symbolic-icons'
make[7]: Nothing to be done for `all-am'.
make[7]: Leaving directory `/home/aaron/builds/unity/Unity-for-Arch/gnome-control-center-ubuntu/src/gnome-control-center-3.4.2/panels/sound/data/symbolic-icons'
make[6]: Leaving directory `/home/aaron/builds/unity/Unity-for-Arch/gnome-control-center-ubuntu/src/gnome-control-center-3.4.2/panels/sound/data/symbolic-icons'
Making all in sounds
make[6]: Entering directory `/home/aaron/builds/unity/Unity-for-Arch/gnome-control-center-ubuntu/src/gnome-control-center-3.4.2/panels/sound/data/sounds'
  GEN      gnome-sounds-default.xml.in
  ITMRG  gnome-sounds-default.xml
make[6]: Leaving directory `/home/aaron/builds/unity/Unity-for-Arch/gnome-control-center-ubuntu/src/gnome-control-center-3.4.2/panels/sound/data/sounds'
make[6]: Entering directory `/home/aaron/builds/unity/Unity-for-Arch/gnome-control-center-ubuntu/src/gnome-control-center-3.4.2/panels/sound/data'
  ITMRG  gnome-sound-panel.desktop
  ITMRG  gnome-sound-applet.desktop
make[6]: Leaving directory `/home/aaron/builds/unity/Unity-for-Arch/gnome-control-center-ubuntu/src/gnome-control-center-3.4.2/panels/sound/data'
make[5]: Leaving directory `/home/aaron/builds/unity/Unity-for-Arch/gnome-control-center-ubuntu/src/gnome-control-center-3.4.2/panels/sound/data'
make[5]: Entering directory `/home/aaron/builds/unity/Unity-for-Arch/gnome-control-center-ubuntu/src/gnome-control-center-3.4.2/panels/sound'
  CC       gvc-balance-bar.lo
gvc-balance-bar.c: In function '_scale_box_new':
gvc-balance-bar.c:97:9: warning: 'gtk_rc_parse_string' is deprecated (declared at /usr/include/gtk-3.0/gtk/deprecated/gtkrc.h:174): Use 'GtkStyleContext' instead [-Wdeprecated-declarations]
  CC       gvc-mixer-dialog.lo
  CC       gvc-level-bar.lo
  CC       gvc-combo-box.lo
  CC       gvc-speaker-test.lo
  CC       gvc-sound-theme-chooser.lo
  CC       sound-theme-file-utils.lo
  CC       cc-sound-panel.lo
  CC       gvc-mixer-card.lo
  CC       gvc-mixer-stream.lo
  CC       gvc-channel-map.lo
  CC       gvc-mixer-sink.lo
  CC       gvc-mixer-source.lo
  CC       gvc-mixer-sink-input.lo
  CC       gvc-mixer-source-output.lo
  CC       gvc-mixer-event-role.lo
  CC       gvc-mixer-control.lo
  CC       gvc-channel-bar.lo
gvc-channel-bar.c: In function '_scale_box_new':
gvc-channel-bar.c:115:17: warning: 'gtk_vscale_new' is deprecated (declared at /usr/include/gtk-3.0/gtk/deprecated/gtkvscale.h:66): Use 'gtk_scale_new' instead [-Wdeprecated-declarations]
  CCLD     libgnomevolumecontrol.la
  CCLD     libsound.la
  CC       gvc-stream-status-icon.o
gvc-stream-status-icon.c: In function 'popup_dock':
gvc-stream-status-icon.c:176:9: warning: 'gdk_pointer_grab' is deprecated (declared at /usr/include/gtk-3.0/gdk/gdkmain.h:81): Use 'gdk_device_grab' instead [-Wdeprecated-declarations]
gvc-stream-status-icon.c:186:9: warning: 'gdk_keyboard_grab' is deprecated (declared at /usr/include/gtk-3.0/gdk/gdkmain.h:88): Use 'gdk_device_grab' instead [-Wdeprecated-declarations]
gvc-stream-status-icon.c:188:17: warning: 'gdk_display_pointer_ungrab' is deprecated (declared at /usr/include/gtk-3.0/gdk/gdkdisplay.h:55): Use 'gdk_device_ungrab' instead [-Wdeprecated-declarations]
gvc-stream-status-icon.c: In function 'on_menu_activate_open_volume_control':
gvc-stream-status-icon.c:224:9: warning: 'gdk_app_launch_context_new' is deprecated (declared at /usr/include/gtk-3.0/gdk/gdkapplaunchcontext.h:43): Use 'gdk_display_get_app_launch_context' instead [-Wdeprecated-declarations]
gvc-stream-status-icon.c: In function 'gvc_icon_release_grab':
gvc-stream-status-icon.c:307:9: warning: 'gdk_display_keyboard_ungrab' is deprecated (declared at /usr/include/gtk-3.0/gdk/gdkdisplay.h:58): Use 'gdk_device_ungrab' instead [-Wdeprecated-declarations]
gvc-stream-status-icon.c:308:9: warning: 'gdk_display_pointer_ungrab' is deprecated (declared at /usr/include/gtk-3.0/gdk/gdkdisplay.h:55): Use 'gdk_device_ungrab' instead [-Wdeprecated-declarations]
gvc-stream-status-icon.c: In function 'popdown_dock':
gvc-stream-status-icon.c:335:9: warning: 'gdk_display_keyboard_ungrab' is deprecated (declared at /usr/include/gtk-3.0/gdk/gdkdisplay.h:58): Use 'gdk_device_ungrab' instead [-Wdeprecated-declarations]
gvc-stream-status-icon.c:336:9: warning: 'gdk_display_pointer_ungrab' is deprecated (declared at /usr/include/gtk-3.0/gdk/gdkdisplay.h:55): Use 'gdk_device_ungrab' instead [-Wdeprecated-declarations]
  CC       gvc-applet.o
  CC       gvc-log.o
  CC       applet-main.o
  CCLD     gnome-sound-applet
make[5]: Leaving directory `/home/aaron/builds/unity/Unity-for-Arch/gnome-control-center-ubuntu/src/gnome-control-center-3.4.2/panels/sound'
make[4]: Leaving directory `/home/aaron/builds/unity/Unity-for-Arch/gnome-control-center-ubuntu/src/gnome-control-center-3.4.2/panels/sound'
make[3]: Leaving directory `/home/aaron/builds/unity/Unity-for-Arch/gnome-control-center-ubuntu/src/gnome-control-center-3.4.2/panels/sound'
Making all in sound-nua
make[3]: Entering directory `/home/aaron/builds/unity/Unity-for-Arch/gnome-control-center-ubuntu/src/gnome-control-center-3.4.2/panels/sound-nua'
make  all-recursive
make[4]: Entering directory `/home/aaron/builds/unity/Unity-for-Arch/gnome-control-center-ubuntu/src/gnome-control-center-3.4.2/panels/sound-nua'
Making all in data
make[5]: Entering directory `/home/aaron/builds/unity/Unity-for-Arch/gnome-control-center-ubuntu/src/gnome-control-center-3.4.2/panels/sound-nua/data'
  ITMRG  gnome-sound-nua-panel.desktop
make[5]: Leaving directory `/home/aaron/builds/unity/Unity-for-Arch/gnome-control-center-ubuntu/src/gnome-control-center-3.4.2/panels/sound-nua/data'
make[5]: Entering directory `/home/aaron/builds/unity/Unity-for-Arch/gnome-control-center-ubuntu/src/gnome-control-center-3.4.2/panels/sound-nua'
  CC       gvc-balance-bar.lo
gvc-balance-bar.c: In function '_scale_box_new':
gvc-balance-bar.c:93:9: warning: 'gtk_hscale_new' is deprecated (declared at /usr/include/gtk-3.0/gtk/deprecated/gtkhscale.h:60): Use 'gtk_scale_new' instead [-Wdeprecated-declarations]
gvc-balance-bar.c:97:9: warning: 'gtk_rc_parse_string' is deprecated (declared at /usr/include/gtk-3.0/gtk/deprecated/gtkrc.h:174): Use 'GtkStyleContext' instead [-Wdeprecated-declarations]
  CC       gvc-mixer-dialog.lo
gvc-mixer-dialog.c: In function 'active_input_update':
gvc-mixer-dialog.c:803:9: warning: passing argument 1 of 'g_hash_table_get_values' discards 'const' qualifier from pointer target type [enabled by default]
In file included from /usr/include/glib-2.0/glib.h:52:0,
                 from gvc-mixer-dialog.c:29:
/usr/include/glib-2.0/glib/ghash.h:101:13: note: expected 'struct GHashTable *' but argument is of type 'const struct GHashTable *'
gvc-mixer-dialog.c: In function 'active_output_update':
gvc-mixer-dialog.c:960:9: warning: passing argument 1 of 'g_hash_table_get_values' discards 'const' qualifier from pointer target type [enabled by default]
In file included from /usr/include/glib-2.0/glib.h:52:0,
                 from gvc-mixer-dialog.c:29:
/usr/include/glib-2.0/glib/ghash.h:101:13: note: expected 'struct GHashTable *' but argument is of type 'const struct GHashTable *'
  CC       gvc-level-bar.lo
  CC       gvc-combo-box.lo
gvc-combo-box.c: In function 'gvc_combo_box_set_profiles':
gvc-combo-box.c:213:9: warning: passing argument 1 of 'g_hash_table_get_keys' discards 'const' qualifier from pointer target type [enabled by default]
In file included from /usr/include/glib-2.0/glib.h:52:0,
                 from gvc-combo-box.c:27:
/usr/include/glib-2.0/glib/ghash.h:100:13: note: expected 'struct GHashTable *' but argument is of type 'const struct GHashTable *'
gvc-combo-box.c:220:17: warning: passing argument 1 of 'g_hash_table_lookup' discards 'const' qualifier from pointer target type [enabled by default]
In file included from /usr/include/glib-2.0/glib.h:52:0,
                 from gvc-combo-box.c:27:
/usr/include/glib-2.0/glib/ghash.h:79:13: note: expected 'struct GHashTable *' but argument is of type 'const struct GHashTable *'
  CC       gvc-speaker-test.lo
gvc-speaker-test.c: In function 'channel_control_new':
gvc-speaker-test.c:318:9: warning: 'gtk_vbox_new' is deprecated (declared at /usr/include/gtk-3.0/gtk/deprecated/gtkvbox.h:60): Use 'gtk_box_new' instead [-Wdeprecated-declarations]
gvc-speaker-test.c:343:9: warning: 'gtk_hbox_new' is deprecated (declared at /usr/include/gtk-3.0/gtk/deprecated/gtkhbox.h:62): Use 'gtk_box_new' instead [-Wdeprecated-declarations]
  CC       gvc-sound-theme-chooser.lo
  CC       sound-theme-file-utils.lo
  CC       cc-sound-panel.lo
  CC       gvc-mixer-card.lo
  CC       gvc-mixer-stream.lo
  CC       gvc-mixer-ui-device.lo
  CC       gvc-channel-map.lo
  CC       gvc-mixer-sink.lo
  CC       gvc-mixer-source.lo
  CC       gvc-mixer-sink-input.lo
  CC       gvc-mixer-source-output.lo
  CC       gvc-mixer-event-role.lo
  CC       gvc-mixer-control.lo
gvc-mixer-control.c: In function 'sync_devices':
gvc-mixer-control.c:1295:9: warning: passing argument 1 of 'g_list_length' discards 'const' qualifier from pointer target type [enabled by default]
In file included from /usr/include/glib-2.0/glib/ghash.h:35:0,
                 from /usr/include/glib-2.0/glib.h:52,
                 from gvc-mixer-control.c:29:
/usr/include/glib-2.0/glib/glist.h:99:10: note: expected 'struct GList *' but argument is of type 'const struct GList *'
gvc-mixer-control.c: In function 'update_sink':
gvc-mixer-control.c:1510:37: warning: assignment discards 'const' qualifier from pointer target type [enabled by default]
gvc-mixer-control.c: In function 'update_source':
gvc-mixer-control.c:1634:37: warning: assignment discards 'const' qualifier from pointer target type [enabled by default]
gvc-mixer-control.c: In function 'update_card':
gvc-mixer-control.c:2073:9: warning: passing argument 1 of 'g_list_length' discards 'const' qualifier from pointer target type [enabled by default]
In file included from /usr/include/glib-2.0/glib/ghash.h:35:0,
                 from /usr/include/glib-2.0/glib.h:52,
                 from gvc-mixer-control.c:29:
/usr/include/glib-2.0/glib/glist.h:99:10: note: expected 'struct GList *' but argument is of type 'const struct GList *'
  CC       gvc-channel-bar.lo
gvc-channel-bar.c: In function '_scale_box_new':
gvc-channel-bar.c:115:17: warning: 'gtk_vscale_new' is deprecated (declared at /usr/include/gtk-3.0/gtk/deprecated/gtkvscale.h:66): Use 'gtk_scale_new' instead [-Wdeprecated-declarations]
gvc-channel-bar.c:141:17: warning: 'gtk_hscale_new' is deprecated (declared at /usr/include/gtk-3.0/gtk/deprecated/gtkhscale.h:60): Use 'gtk_scale_new' instead [-Wdeprecated-declarations]
  CCLD     libgnomevolumecontrol.la
  CCLD     libsoundnua.la
make[5]: Leaving directory `/home/aaron/builds/unity/Unity-for-Arch/gnome-control-center-ubuntu/src/gnome-control-center-3.4.2/panels/sound-nua'
make[4]: Leaving directory `/home/aaron/builds/unity/Unity-for-Arch/gnome-control-center-ubuntu/src/gnome-control-center-3.4.2/panels/sound-nua'
make[3]: Leaving directory `/home/aaron/builds/unity/Unity-for-Arch/gnome-control-center-ubuntu/src/gnome-control-center-3.4.2/panels/sound-nua'
Making all in keyboard
make[3]: Entering directory `/home/aaron/builds/unity/Unity-for-Arch/gnome-control-center-ubuntu/src/gnome-control-center-3.4.2/panels/keyboard'
  CC       libkeyboard_la-keyboard-module.lo
  CC       libkeyboard_la-cc-keyboard-panel.lo
  CC       libkeyboard_la-cc-keyboard-item.lo
  CC       libkeyboard_la-wm-common.lo
  CC       libkeyboard_la-keyboard-general.lo
  CC       libkeyboard_la-keyboard-shortcuts.lo
keyboard-shortcuts.c: In function 'setup_dialog':
keyboard-shortcuts.c:1629:62: error: 'GTK_CELL_RENDERER_ACCEL_MODE_MODIFIER_TAP' undeclared (first use in this function)
keyboard-shortcuts.c:1629:62: note: each undeclared identifier is reported only once for each function it appears in
make[3]: *** [libkeyboard_la-keyboard-shortcuts.lo] Error 1
make[3]: Leaving directory `/home/aaron/builds/unity/Unity-for-Arch/gnome-control-center-ubuntu/src/gnome-control-center-3.4.2/panels/keyboard'
make[2]: *** [all-recursive] Error 1
make[2]: Leaving directory `/home/aaron/builds/unity/Unity-for-Arch/gnome-control-center-ubuntu/src/gnome-control-center-3.4.2/panels'
make[1]: *** [all-recursive] Error 1
make[1]: Leaving directory `/home/aaron/builds/unity/Unity-for-Arch/gnome-control-center-ubuntu/src/gnome-control-center-3.4.2'
make: *** [all] Error 2
==> ERROR: A failure occurred in build().
    Aborting...

Many thanks!

Offline

#952 2012-09-11 18:49:40

chenxiaolong
Member
From: /home/chenxiaolong
Registered: 2010-11-03
Posts: 779

Re: Progress on Unity under Arch Linux!

slovdahl wrote:
chenxiaolong wrote:
slovdahl wrote:

I'm having problems compiling compiz-ubuntu. Completly new and clean x86_64 installation of arch (as of today), and this is the error message I get:

CMake Error at plugins/ccp/CMakeLists.txt:3 (compiz_plugin):
  Unknown CMake command "compiz_plugin".


-- Configuring incomplete, errors occurred!
==> ERROR: A failure occurred in build().
    Aborting...


Any suggestions?

Could you post the complete build output? Thanks!

Of course, here it is.

Thanks! It seems that I didn't add metacity to the dependencies. It should build fine now smile


Current system: Lenovo W520
Unity-for-Arch repos' build statuses and old packages: https://jenkins.noobdev.io/

Offline

#953 2012-09-12 04:19:32

chenxiaolong
Member
From: /home/chenxiaolong
Registered: 2010-11-03
Posts: 779

Re: Progress on Unity under Arch Linux!

aabmass wrote:

I'm having problems building gnome-control-center now. Output is:

  CCLD     libonline-accounts.la
  ITMRG  gnome-online-accounts-panel.desktop
make[4]: Leaving directory `/home/aaron/builds/unity/Unity-for-Arch/gnome-control-center-ubuntu/src/gnome-control-center-3.4.2/panels/online-accounts'
make[3]: Leaving directory `/home/aaron/builds/unity/Unity-for-Arch/gnome-control-center-ubuntu/src/gnome-control-center-3.4.2/panels/online-accounts'
Making all in region
make[3]: Entering directory `/home/aaron/builds/unity/Unity-for-Arch/gnome-control-center-ubuntu/src/gnome-control-center-3.4.2/panels/region'
  CC       region-module.lo
  CC       cc-region-panel.lo
  CC       gnome-region-panel-formats.lo
  CC       gnome-region-panel-lang.lo
  CC       gnome-region-panel-system.lo
  CC       gnome-region-panel-xkb.lo
  CC       gnome-region-panel-xkblt.lo
  CC       gnome-region-panel-xkbltadd.lo
  CC       gnome-region-panel-xkbot.lo
  CC       gnome-region-panel-xkbpv.lo
  CCLD     libregion.la
  ITMRG  gnome-region-panel.desktop
make[3]: Leaving directory `/home/aaron/builds/unity/Unity-for-Arch/gnome-control-center-ubuntu/src/gnome-control-center-3.4.2/panels/region'
Making all in info
make[3]: Entering directory `/home/aaron/builds/unity/Unity-for-Arch/gnome-control-center-ubuntu/src/gnome-control-center-3.4.2/panels/info'
  CC       info-module.lo
  CC       cc-info-panel.lo
cc-info-panel.c: In function 'default_app_changed':
cc-info-panel.c:934:18: warning: assignment makes pointer from integer without a cast [enabled by default]
  CC       hostname-helper.lo
  CC       gsd-disk-space-helper.lo
  CCLD     libinfo.la
  CC       test_hostname-hostname-helper.o
  CC       test_hostname-test-hostname.o
  CCLD     test-hostname
  ITMRG  gnome-info-panel.desktop
./test-hostname ./hostnames-test.txt > /dev/null
make[3]: Leaving directory `/home/aaron/builds/unity/Unity-for-Arch/gnome-control-center-ubuntu/src/gnome-control-center-3.4.2/panels/info'
Making all in sound
make[3]: Entering directory `/home/aaron/builds/unity/Unity-for-Arch/gnome-control-center-ubuntu/src/gnome-control-center-3.4.2/panels/sound'
make  all-recursive
make[4]: Entering directory `/home/aaron/builds/unity/Unity-for-Arch/gnome-control-center-ubuntu/src/gnome-control-center-3.4.2/panels/sound'
Making all in data
make[5]: Entering directory `/home/aaron/builds/unity/Unity-for-Arch/gnome-control-center-ubuntu/src/gnome-control-center-3.4.2/panels/sound/data'
Making all in icons
make[6]: Entering directory `/home/aaron/builds/unity/Unity-for-Arch/gnome-control-center-ubuntu/src/gnome-control-center-3.4.2/panels/sound/data/icons'
Making all in scalable
make[7]: Entering directory `/home/aaron/builds/unity/Unity-for-Arch/gnome-control-center-ubuntu/src/gnome-control-center-3.4.2/panels/sound/data/icons/scalable'
Making all in apps
make[8]: Entering directory `/home/aaron/builds/unity/Unity-for-Arch/gnome-control-center-ubuntu/src/gnome-control-center-3.4.2/panels/sound/data/icons/scalable/apps'
make[8]: Nothing to be done for `all'.
make[8]: Leaving directory `/home/aaron/builds/unity/Unity-for-Arch/gnome-control-center-ubuntu/src/gnome-control-center-3.4.2/panels/sound/data/icons/scalable/apps'
Making all in devices
make[8]: Entering directory `/home/aaron/builds/unity/Unity-for-Arch/gnome-control-center-ubuntu/src/gnome-control-center-3.4.2/panels/sound/data/icons/scalable/devices'
make[8]: Nothing to be done for `all'.
make[8]: Leaving directory `/home/aaron/builds/unity/Unity-for-Arch/gnome-control-center-ubuntu/src/gnome-control-center-3.4.2/panels/sound/data/icons/scalable/devices'
make[8]: Entering directory `/home/aaron/builds/unity/Unity-for-Arch/gnome-control-center-ubuntu/src/gnome-control-center-3.4.2/panels/sound/data/icons/scalable'
make[8]: Nothing to be done for `all-am'.
make[8]: Leaving directory `/home/aaron/builds/unity/Unity-for-Arch/gnome-control-center-ubuntu/src/gnome-control-center-3.4.2/panels/sound/data/icons/scalable'
make[7]: Leaving directory `/home/aaron/builds/unity/Unity-for-Arch/gnome-control-center-ubuntu/src/gnome-control-center-3.4.2/panels/sound/data/icons/scalable'
Making all in 16x16
make[7]: Entering directory `/home/aaron/builds/unity/Unity-for-Arch/gnome-control-center-ubuntu/src/gnome-control-center-3.4.2/panels/sound/data/icons/16x16'
Making all in status
make[8]: Entering directory `/home/aaron/builds/unity/Unity-for-Arch/gnome-control-center-ubuntu/src/gnome-control-center-3.4.2/panels/sound/data/icons/16x16/status'
make[8]: Nothing to be done for `all'.
make[8]: Leaving directory `/home/aaron/builds/unity/Unity-for-Arch/gnome-control-center-ubuntu/src/gnome-control-center-3.4.2/panels/sound/data/icons/16x16/status'
Making all in apps
make[8]: Entering directory `/home/aaron/builds/unity/Unity-for-Arch/gnome-control-center-ubuntu/src/gnome-control-center-3.4.2/panels/sound/data/icons/16x16/apps'
make[8]: Nothing to be done for `all'.
make[8]: Leaving directory `/home/aaron/builds/unity/Unity-for-Arch/gnome-control-center-ubuntu/src/gnome-control-center-3.4.2/panels/sound/data/icons/16x16/apps'
Making all in devices
make[8]: Entering directory `/home/aaron/builds/unity/Unity-for-Arch/gnome-control-center-ubuntu/src/gnome-control-center-3.4.2/panels/sound/data/icons/16x16/devices'
make[8]: Nothing to be done for `all'.
make[8]: Leaving directory `/home/aaron/builds/unity/Unity-for-Arch/gnome-control-center-ubuntu/src/gnome-control-center-3.4.2/panels/sound/data/icons/16x16/devices'
make[8]: Entering directory `/home/aaron/builds/unity/Unity-for-Arch/gnome-control-center-ubuntu/src/gnome-control-center-3.4.2/panels/sound/data/icons/16x16'
make[8]: Nothing to be done for `all-am'.
make[8]: Leaving directory `/home/aaron/builds/unity/Unity-for-Arch/gnome-control-center-ubuntu/src/gnome-control-center-3.4.2/panels/sound/data/icons/16x16'
make[7]: Leaving directory `/home/aaron/builds/unity/Unity-for-Arch/gnome-control-center-ubuntu/src/gnome-control-center-3.4.2/panels/sound/data/icons/16x16'
Making all in 22x22
make[7]: Entering directory `/home/aaron/builds/unity/Unity-for-Arch/gnome-control-center-ubuntu/src/gnome-control-center-3.4.2/panels/sound/data/icons/22x22'
Making all in status
make[8]: Entering directory `/home/aaron/builds/unity/Unity-for-Arch/gnome-control-center-ubuntu/src/gnome-control-center-3.4.2/panels/sound/data/icons/22x22/status'
make[8]: Nothing to be done for `all'.
make[8]: Leaving directory `/home/aaron/builds/unity/Unity-for-Arch/gnome-control-center-ubuntu/src/gnome-control-center-3.4.2/panels/sound/data/icons/22x22/status'
Making all in apps
make[8]: Entering directory `/home/aaron/builds/unity/Unity-for-Arch/gnome-control-center-ubuntu/src/gnome-control-center-3.4.2/panels/sound/data/icons/22x22/apps'
make[8]: Nothing to be done for `all'.
make[8]: Leaving directory `/home/aaron/builds/unity/Unity-for-Arch/gnome-control-center-ubuntu/src/gnome-control-center-3.4.2/panels/sound/data/icons/22x22/apps'
make[8]: Entering directory `/home/aaron/builds/unity/Unity-for-Arch/gnome-control-center-ubuntu/src/gnome-control-center-3.4.2/panels/sound/data/icons/22x22'
make[8]: Nothing to be done for `all-am'.
make[8]: Leaving directory `/home/aaron/builds/unity/Unity-for-Arch/gnome-control-center-ubuntu/src/gnome-control-center-3.4.2/panels/sound/data/icons/22x22'
make[7]: Leaving directory `/home/aaron/builds/unity/Unity-for-Arch/gnome-control-center-ubuntu/src/gnome-control-center-3.4.2/panels/sound/data/icons/22x22'
Making all in 24x24
make[7]: Entering directory `/home/aaron/builds/unity/Unity-for-Arch/gnome-control-center-ubuntu/src/gnome-control-center-3.4.2/panels/sound/data/icons/24x24'
Making all in status
make[8]: Entering directory `/home/aaron/builds/unity/Unity-for-Arch/gnome-control-center-ubuntu/src/gnome-control-center-3.4.2/panels/sound/data/icons/24x24/status'
make[8]: Nothing to be done for `all'.
make[8]: Leaving directory `/home/aaron/builds/unity/Unity-for-Arch/gnome-control-center-ubuntu/src/gnome-control-center-3.4.2/panels/sound/data/icons/24x24/status'
Making all in apps
make[8]: Entering directory `/home/aaron/builds/unity/Unity-for-Arch/gnome-control-center-ubuntu/src/gnome-control-center-3.4.2/panels/sound/data/icons/24x24/apps'
make[8]: Nothing to be done for `all'.
make[8]: Leaving directory `/home/aaron/builds/unity/Unity-for-Arch/gnome-control-center-ubuntu/src/gnome-control-center-3.4.2/panels/sound/data/icons/24x24/apps'
Making all in devices
make[8]: Entering directory `/home/aaron/builds/unity/Unity-for-Arch/gnome-control-center-ubuntu/src/gnome-control-center-3.4.2/panels/sound/data/icons/24x24/devices'
make[8]: Nothing to be done for `all'.
make[8]: Leaving directory `/home/aaron/builds/unity/Unity-for-Arch/gnome-control-center-ubuntu/src/gnome-control-center-3.4.2/panels/sound/data/icons/24x24/devices'
make[8]: Entering directory `/home/aaron/builds/unity/Unity-for-Arch/gnome-control-center-ubuntu/src/gnome-control-center-3.4.2/panels/sound/data/icons/24x24'
make[8]: Nothing to be done for `all-am'.
make[8]: Leaving directory `/home/aaron/builds/unity/Unity-for-Arch/gnome-control-center-ubuntu/src/gnome-control-center-3.4.2/panels/sound/data/icons/24x24'
make[7]: Leaving directory `/home/aaron/builds/unity/Unity-for-Arch/gnome-control-center-ubuntu/src/gnome-control-center-3.4.2/panels/sound/data/icons/24x24'
Making all in 32x32
make[7]: Entering directory `/home/aaron/builds/unity/Unity-for-Arch/gnome-control-center-ubuntu/src/gnome-control-center-3.4.2/panels/sound/data/icons/32x32'
Making all in status
make[8]: Entering directory `/home/aaron/builds/unity/Unity-for-Arch/gnome-control-center-ubuntu/src/gnome-control-center-3.4.2/panels/sound/data/icons/32x32/status'
make[8]: Nothing to be done for `all'.
make[8]: Leaving directory `/home/aaron/builds/unity/Unity-for-Arch/gnome-control-center-ubuntu/src/gnome-control-center-3.4.2/panels/sound/data/icons/32x32/status'
Making all in apps
make[8]: Entering directory `/home/aaron/builds/unity/Unity-for-Arch/gnome-control-center-ubuntu/src/gnome-control-center-3.4.2/panels/sound/data/icons/32x32/apps'
make[8]: Nothing to be done for `all'.
make[8]: Leaving directory `/home/aaron/builds/unity/Unity-for-Arch/gnome-control-center-ubuntu/src/gnome-control-center-3.4.2/panels/sound/data/icons/32x32/apps'
Making all in devices
make[8]: Entering directory `/home/aaron/builds/unity/Unity-for-Arch/gnome-control-center-ubuntu/src/gnome-control-center-3.4.2/panels/sound/data/icons/32x32/devices'
make[8]: Nothing to be done for `all'.
make[8]: Leaving directory `/home/aaron/builds/unity/Unity-for-Arch/gnome-control-center-ubuntu/src/gnome-control-center-3.4.2/panels/sound/data/icons/32x32/devices'
make[8]: Entering directory `/home/aaron/builds/unity/Unity-for-Arch/gnome-control-center-ubuntu/src/gnome-control-center-3.4.2/panels/sound/data/icons/32x32'
make[8]: Nothing to be done for `all-am'.
make[8]: Leaving directory `/home/aaron/builds/unity/Unity-for-Arch/gnome-control-center-ubuntu/src/gnome-control-center-3.4.2/panels/sound/data/icons/32x32'
make[7]: Leaving directory `/home/aaron/builds/unity/Unity-for-Arch/gnome-control-center-ubuntu/src/gnome-control-center-3.4.2/panels/sound/data/icons/32x32'
Making all in 48x48
make[7]: Entering directory `/home/aaron/builds/unity/Unity-for-Arch/gnome-control-center-ubuntu/src/gnome-control-center-3.4.2/panels/sound/data/icons/48x48'
Making all in apps
make[8]: Entering directory `/home/aaron/builds/unity/Unity-for-Arch/gnome-control-center-ubuntu/src/gnome-control-center-3.4.2/panels/sound/data/icons/48x48/apps'
make[8]: Nothing to be done for `all'.
make[8]: Leaving directory `/home/aaron/builds/unity/Unity-for-Arch/gnome-control-center-ubuntu/src/gnome-control-center-3.4.2/panels/sound/data/icons/48x48/apps'
Making all in devices
make[8]: Entering directory `/home/aaron/builds/unity/Unity-for-Arch/gnome-control-center-ubuntu/src/gnome-control-center-3.4.2/panels/sound/data/icons/48x48/devices'
make[8]: Nothing to be done for `all'.
make[8]: Leaving directory `/home/aaron/builds/unity/Unity-for-Arch/gnome-control-center-ubuntu/src/gnome-control-center-3.4.2/panels/sound/data/icons/48x48/devices'
make[8]: Entering directory `/home/aaron/builds/unity/Unity-for-Arch/gnome-control-center-ubuntu/src/gnome-control-center-3.4.2/panels/sound/data/icons/48x48'
make[8]: Nothing to be done for `all-am'.
make[8]: Leaving directory `/home/aaron/builds/unity/Unity-for-Arch/gnome-control-center-ubuntu/src/gnome-control-center-3.4.2/panels/sound/data/icons/48x48'
make[7]: Leaving directory `/home/aaron/builds/unity/Unity-for-Arch/gnome-control-center-ubuntu/src/gnome-control-center-3.4.2/panels/sound/data/icons/48x48'
make[7]: Entering directory `/home/aaron/builds/unity/Unity-for-Arch/gnome-control-center-ubuntu/src/gnome-control-center-3.4.2/panels/sound/data/icons'
make[7]: Nothing to be done for `all-am'.
make[7]: Leaving directory `/home/aaron/builds/unity/Unity-for-Arch/gnome-control-center-ubuntu/src/gnome-control-center-3.4.2/panels/sound/data/icons'
make[6]: Leaving directory `/home/aaron/builds/unity/Unity-for-Arch/gnome-control-center-ubuntu/src/gnome-control-center-3.4.2/panels/sound/data/icons'
Making all in symbolic-icons
make[6]: Entering directory `/home/aaron/builds/unity/Unity-for-Arch/gnome-control-center-ubuntu/src/gnome-control-center-3.4.2/panels/sound/data/symbolic-icons'
Making all in scalable
make[7]: Entering directory `/home/aaron/builds/unity/Unity-for-Arch/gnome-control-center-ubuntu/src/gnome-control-center-3.4.2/panels/sound/data/symbolic-icons/scalable'
Making all in status
make[8]: Entering directory `/home/aaron/builds/unity/Unity-for-Arch/gnome-control-center-ubuntu/src/gnome-control-center-3.4.2/panels/sound/data/symbolic-icons/scalable/status'
make[8]: Nothing to be done for `all'.
make[8]: Leaving directory `/home/aaron/builds/unity/Unity-for-Arch/gnome-control-center-ubuntu/src/gnome-control-center-3.4.2/panels/sound/data/symbolic-icons/scalable/status'
make[8]: Entering directory `/home/aaron/builds/unity/Unity-for-Arch/gnome-control-center-ubuntu/src/gnome-control-center-3.4.2/panels/sound/data/symbolic-icons/scalable'
make[8]: Nothing to be done for `all-am'.
make[8]: Leaving directory `/home/aaron/builds/unity/Unity-for-Arch/gnome-control-center-ubuntu/src/gnome-control-center-3.4.2/panels/sound/data/symbolic-icons/scalable'
make[7]: Leaving directory `/home/aaron/builds/unity/Unity-for-Arch/gnome-control-center-ubuntu/src/gnome-control-center-3.4.2/panels/sound/data/symbolic-icons/scalable'
make[7]: Entering directory `/home/aaron/builds/unity/Unity-for-Arch/gnome-control-center-ubuntu/src/gnome-control-center-3.4.2/panels/sound/data/symbolic-icons'
make[7]: Nothing to be done for `all-am'.
make[7]: Leaving directory `/home/aaron/builds/unity/Unity-for-Arch/gnome-control-center-ubuntu/src/gnome-control-center-3.4.2/panels/sound/data/symbolic-icons'
make[6]: Leaving directory `/home/aaron/builds/unity/Unity-for-Arch/gnome-control-center-ubuntu/src/gnome-control-center-3.4.2/panels/sound/data/symbolic-icons'
Making all in sounds
make[6]: Entering directory `/home/aaron/builds/unity/Unity-for-Arch/gnome-control-center-ubuntu/src/gnome-control-center-3.4.2/panels/sound/data/sounds'
  GEN      gnome-sounds-default.xml.in
  ITMRG  gnome-sounds-default.xml
make[6]: Leaving directory `/home/aaron/builds/unity/Unity-for-Arch/gnome-control-center-ubuntu/src/gnome-control-center-3.4.2/panels/sound/data/sounds'
make[6]: Entering directory `/home/aaron/builds/unity/Unity-for-Arch/gnome-control-center-ubuntu/src/gnome-control-center-3.4.2/panels/sound/data'
  ITMRG  gnome-sound-panel.desktop
  ITMRG  gnome-sound-applet.desktop
make[6]: Leaving directory `/home/aaron/builds/unity/Unity-for-Arch/gnome-control-center-ubuntu/src/gnome-control-center-3.4.2/panels/sound/data'
make[5]: Leaving directory `/home/aaron/builds/unity/Unity-for-Arch/gnome-control-center-ubuntu/src/gnome-control-center-3.4.2/panels/sound/data'
make[5]: Entering directory `/home/aaron/builds/unity/Unity-for-Arch/gnome-control-center-ubuntu/src/gnome-control-center-3.4.2/panels/sound'
  CC       gvc-balance-bar.lo
gvc-balance-bar.c: In function '_scale_box_new':
gvc-balance-bar.c:97:9: warning: 'gtk_rc_parse_string' is deprecated (declared at /usr/include/gtk-3.0/gtk/deprecated/gtkrc.h:174): Use 'GtkStyleContext' instead [-Wdeprecated-declarations]
  CC       gvc-mixer-dialog.lo
  CC       gvc-level-bar.lo
  CC       gvc-combo-box.lo
  CC       gvc-speaker-test.lo
  CC       gvc-sound-theme-chooser.lo
  CC       sound-theme-file-utils.lo
  CC       cc-sound-panel.lo
  CC       gvc-mixer-card.lo
  CC       gvc-mixer-stream.lo
  CC       gvc-channel-map.lo
  CC       gvc-mixer-sink.lo
  CC       gvc-mixer-source.lo
  CC       gvc-mixer-sink-input.lo
  CC       gvc-mixer-source-output.lo
  CC       gvc-mixer-event-role.lo
  CC       gvc-mixer-control.lo
  CC       gvc-channel-bar.lo
gvc-channel-bar.c: In function '_scale_box_new':
gvc-channel-bar.c:115:17: warning: 'gtk_vscale_new' is deprecated (declared at /usr/include/gtk-3.0/gtk/deprecated/gtkvscale.h:66): Use 'gtk_scale_new' instead [-Wdeprecated-declarations]
  CCLD     libgnomevolumecontrol.la
  CCLD     libsound.la
  CC       gvc-stream-status-icon.o
gvc-stream-status-icon.c: In function 'popup_dock':
gvc-stream-status-icon.c:176:9: warning: 'gdk_pointer_grab' is deprecated (declared at /usr/include/gtk-3.0/gdk/gdkmain.h:81): Use 'gdk_device_grab' instead [-Wdeprecated-declarations]
gvc-stream-status-icon.c:186:9: warning: 'gdk_keyboard_grab' is deprecated (declared at /usr/include/gtk-3.0/gdk/gdkmain.h:88): Use 'gdk_device_grab' instead [-Wdeprecated-declarations]
gvc-stream-status-icon.c:188:17: warning: 'gdk_display_pointer_ungrab' is deprecated (declared at /usr/include/gtk-3.0/gdk/gdkdisplay.h:55): Use 'gdk_device_ungrab' instead [-Wdeprecated-declarations]
gvc-stream-status-icon.c: In function 'on_menu_activate_open_volume_control':
gvc-stream-status-icon.c:224:9: warning: 'gdk_app_launch_context_new' is deprecated (declared at /usr/include/gtk-3.0/gdk/gdkapplaunchcontext.h:43): Use 'gdk_display_get_app_launch_context' instead [-Wdeprecated-declarations]
gvc-stream-status-icon.c: In function 'gvc_icon_release_grab':
gvc-stream-status-icon.c:307:9: warning: 'gdk_display_keyboard_ungrab' is deprecated (declared at /usr/include/gtk-3.0/gdk/gdkdisplay.h:58): Use 'gdk_device_ungrab' instead [-Wdeprecated-declarations]
gvc-stream-status-icon.c:308:9: warning: 'gdk_display_pointer_ungrab' is deprecated (declared at /usr/include/gtk-3.0/gdk/gdkdisplay.h:55): Use 'gdk_device_ungrab' instead [-Wdeprecated-declarations]
gvc-stream-status-icon.c: In function 'popdown_dock':
gvc-stream-status-icon.c:335:9: warning: 'gdk_display_keyboard_ungrab' is deprecated (declared at /usr/include/gtk-3.0/gdk/gdkdisplay.h:58): Use 'gdk_device_ungrab' instead [-Wdeprecated-declarations]
gvc-stream-status-icon.c:336:9: warning: 'gdk_display_pointer_ungrab' is deprecated (declared at /usr/include/gtk-3.0/gdk/gdkdisplay.h:55): Use 'gdk_device_ungrab' instead [-Wdeprecated-declarations]
  CC       gvc-applet.o
  CC       gvc-log.o
  CC       applet-main.o
  CCLD     gnome-sound-applet
make[5]: Leaving directory `/home/aaron/builds/unity/Unity-for-Arch/gnome-control-center-ubuntu/src/gnome-control-center-3.4.2/panels/sound'
make[4]: Leaving directory `/home/aaron/builds/unity/Unity-for-Arch/gnome-control-center-ubuntu/src/gnome-control-center-3.4.2/panels/sound'
make[3]: Leaving directory `/home/aaron/builds/unity/Unity-for-Arch/gnome-control-center-ubuntu/src/gnome-control-center-3.4.2/panels/sound'
Making all in sound-nua
make[3]: Entering directory `/home/aaron/builds/unity/Unity-for-Arch/gnome-control-center-ubuntu/src/gnome-control-center-3.4.2/panels/sound-nua'
make  all-recursive
make[4]: Entering directory `/home/aaron/builds/unity/Unity-for-Arch/gnome-control-center-ubuntu/src/gnome-control-center-3.4.2/panels/sound-nua'
Making all in data
make[5]: Entering directory `/home/aaron/builds/unity/Unity-for-Arch/gnome-control-center-ubuntu/src/gnome-control-center-3.4.2/panels/sound-nua/data'
  ITMRG  gnome-sound-nua-panel.desktop
make[5]: Leaving directory `/home/aaron/builds/unity/Unity-for-Arch/gnome-control-center-ubuntu/src/gnome-control-center-3.4.2/panels/sound-nua/data'
make[5]: Entering directory `/home/aaron/builds/unity/Unity-for-Arch/gnome-control-center-ubuntu/src/gnome-control-center-3.4.2/panels/sound-nua'
  CC       gvc-balance-bar.lo
gvc-balance-bar.c: In function '_scale_box_new':
gvc-balance-bar.c:93:9: warning: 'gtk_hscale_new' is deprecated (declared at /usr/include/gtk-3.0/gtk/deprecated/gtkhscale.h:60): Use 'gtk_scale_new' instead [-Wdeprecated-declarations]
gvc-balance-bar.c:97:9: warning: 'gtk_rc_parse_string' is deprecated (declared at /usr/include/gtk-3.0/gtk/deprecated/gtkrc.h:174): Use 'GtkStyleContext' instead [-Wdeprecated-declarations]
  CC       gvc-mixer-dialog.lo
gvc-mixer-dialog.c: In function 'active_input_update':
gvc-mixer-dialog.c:803:9: warning: passing argument 1 of 'g_hash_table_get_values' discards 'const' qualifier from pointer target type [enabled by default]
In file included from /usr/include/glib-2.0/glib.h:52:0,
                 from gvc-mixer-dialog.c:29:
/usr/include/glib-2.0/glib/ghash.h:101:13: note: expected 'struct GHashTable *' but argument is of type 'const struct GHashTable *'
gvc-mixer-dialog.c: In function 'active_output_update':
gvc-mixer-dialog.c:960:9: warning: passing argument 1 of 'g_hash_table_get_values' discards 'const' qualifier from pointer target type [enabled by default]
In file included from /usr/include/glib-2.0/glib.h:52:0,
                 from gvc-mixer-dialog.c:29:
/usr/include/glib-2.0/glib/ghash.h:101:13: note: expected 'struct GHashTable *' but argument is of type 'const struct GHashTable *'
  CC       gvc-level-bar.lo
  CC       gvc-combo-box.lo
gvc-combo-box.c: In function 'gvc_combo_box_set_profiles':
gvc-combo-box.c:213:9: warning: passing argument 1 of 'g_hash_table_get_keys' discards 'const' qualifier from pointer target type [enabled by default]
In file included from /usr/include/glib-2.0/glib.h:52:0,
                 from gvc-combo-box.c:27:
/usr/include/glib-2.0/glib/ghash.h:100:13: note: expected 'struct GHashTable *' but argument is of type 'const struct GHashTable *'
gvc-combo-box.c:220:17: warning: passing argument 1 of 'g_hash_table_lookup' discards 'const' qualifier from pointer target type [enabled by default]
In file included from /usr/include/glib-2.0/glib.h:52:0,
                 from gvc-combo-box.c:27:
/usr/include/glib-2.0/glib/ghash.h:79:13: note: expected 'struct GHashTable *' but argument is of type 'const struct GHashTable *'
  CC       gvc-speaker-test.lo
gvc-speaker-test.c: In function 'channel_control_new':
gvc-speaker-test.c:318:9: warning: 'gtk_vbox_new' is deprecated (declared at /usr/include/gtk-3.0/gtk/deprecated/gtkvbox.h:60): Use 'gtk_box_new' instead [-Wdeprecated-declarations]
gvc-speaker-test.c:343:9: warning: 'gtk_hbox_new' is deprecated (declared at /usr/include/gtk-3.0/gtk/deprecated/gtkhbox.h:62): Use 'gtk_box_new' instead [-Wdeprecated-declarations]
  CC       gvc-sound-theme-chooser.lo
  CC       sound-theme-file-utils.lo
  CC       cc-sound-panel.lo
  CC       gvc-mixer-card.lo
  CC       gvc-mixer-stream.lo
  CC       gvc-mixer-ui-device.lo
  CC       gvc-channel-map.lo
  CC       gvc-mixer-sink.lo
  CC       gvc-mixer-source.lo
  CC       gvc-mixer-sink-input.lo
  CC       gvc-mixer-source-output.lo
  CC       gvc-mixer-event-role.lo
  CC       gvc-mixer-control.lo
gvc-mixer-control.c: In function 'sync_devices':
gvc-mixer-control.c:1295:9: warning: passing argument 1 of 'g_list_length' discards 'const' qualifier from pointer target type [enabled by default]
In file included from /usr/include/glib-2.0/glib/ghash.h:35:0,
                 from /usr/include/glib-2.0/glib.h:52,
                 from gvc-mixer-control.c:29:
/usr/include/glib-2.0/glib/glist.h:99:10: note: expected 'struct GList *' but argument is of type 'const struct GList *'
gvc-mixer-control.c: In function 'update_sink':
gvc-mixer-control.c:1510:37: warning: assignment discards 'const' qualifier from pointer target type [enabled by default]
gvc-mixer-control.c: In function 'update_source':
gvc-mixer-control.c:1634:37: warning: assignment discards 'const' qualifier from pointer target type [enabled by default]
gvc-mixer-control.c: In function 'update_card':
gvc-mixer-control.c:2073:9: warning: passing argument 1 of 'g_list_length' discards 'const' qualifier from pointer target type [enabled by default]
In file included from /usr/include/glib-2.0/glib/ghash.h:35:0,
                 from /usr/include/glib-2.0/glib.h:52,
                 from gvc-mixer-control.c:29:
/usr/include/glib-2.0/glib/glist.h:99:10: note: expected 'struct GList *' but argument is of type 'const struct GList *'
  CC       gvc-channel-bar.lo
gvc-channel-bar.c: In function '_scale_box_new':
gvc-channel-bar.c:115:17: warning: 'gtk_vscale_new' is deprecated (declared at /usr/include/gtk-3.0/gtk/deprecated/gtkvscale.h:66): Use 'gtk_scale_new' instead [-Wdeprecated-declarations]
gvc-channel-bar.c:141:17: warning: 'gtk_hscale_new' is deprecated (declared at /usr/include/gtk-3.0/gtk/deprecated/gtkhscale.h:60): Use 'gtk_scale_new' instead [-Wdeprecated-declarations]
  CCLD     libgnomevolumecontrol.la
  CCLD     libsoundnua.la
make[5]: Leaving directory `/home/aaron/builds/unity/Unity-for-Arch/gnome-control-center-ubuntu/src/gnome-control-center-3.4.2/panels/sound-nua'
make[4]: Leaving directory `/home/aaron/builds/unity/Unity-for-Arch/gnome-control-center-ubuntu/src/gnome-control-center-3.4.2/panels/sound-nua'
make[3]: Leaving directory `/home/aaron/builds/unity/Unity-for-Arch/gnome-control-center-ubuntu/src/gnome-control-center-3.4.2/panels/sound-nua'
Making all in keyboard
make[3]: Entering directory `/home/aaron/builds/unity/Unity-for-Arch/gnome-control-center-ubuntu/src/gnome-control-center-3.4.2/panels/keyboard'
  CC       libkeyboard_la-keyboard-module.lo
  CC       libkeyboard_la-cc-keyboard-panel.lo
  CC       libkeyboard_la-cc-keyboard-item.lo
  CC       libkeyboard_la-wm-common.lo
  CC       libkeyboard_la-keyboard-general.lo
  CC       libkeyboard_la-keyboard-shortcuts.lo
keyboard-shortcuts.c: In function 'setup_dialog':
keyboard-shortcuts.c:1629:62: error: 'GTK_CELL_RENDERER_ACCEL_MODE_MODIFIER_TAP' undeclared (first use in this function)
keyboard-shortcuts.c:1629:62: note: each undeclared identifier is reported only once for each function it appears in
make[3]: *** [libkeyboard_la-keyboard-shortcuts.lo] Error 1
make[3]: Leaving directory `/home/aaron/builds/unity/Unity-for-Arch/gnome-control-center-ubuntu/src/gnome-control-center-3.4.2/panels/keyboard'
make[2]: *** [all-recursive] Error 1
make[2]: Leaving directory `/home/aaron/builds/unity/Unity-for-Arch/gnome-control-center-ubuntu/src/gnome-control-center-3.4.2/panels'
make[1]: *** [all-recursive] Error 1
make[1]: Leaving directory `/home/aaron/builds/unity/Unity-for-Arch/gnome-control-center-ubuntu/src/gnome-control-center-3.4.2'
make: *** [all] Error 2
==> ERROR: A failure occurred in build().
    Aborting...

Many thanks!

Sorry, I didn't have a chance to look into this today. I was doing homework for several hours (ugh...school...:D).

Last edited by chenxiaolong (2012-09-12 04:19:44)


Current system: Lenovo W520
Unity-for-Arch repos' build statuses and old packages: https://jenkins.noobdev.io/

Offline

#954 2012-09-12 05:51:38

slovdahl
Member
Registered: 2012-09-10
Posts: 10

Re: Progress on Unity under Arch Linux!

chenxiaolong wrote:
slovdahl wrote:
chenxiaolong wrote:

Could you post the complete build output? Thanks!

Of course, here it is.

Thanks! It seems that I didn't add metacity to the dependencies. It should build fine now smile

Now metacity and zenity was installed, but it still fails at the same spot with the same error message.

Offline

#955 2012-09-12 05:54:45

chenxiaolong
Member
From: /home/chenxiaolong
Registered: 2010-11-03
Posts: 779

Re: Progress on Unity under Arch Linux!

slovdahl wrote:
chenxiaolong wrote:
slovdahl wrote:

Of course, here it is.

Thanks! It seems that I didn't add metacity to the dependencies. It should build fine now smile

Now metacity and zenity was installed, but it still fails at the same spot with the same error message.

Could you post the full build log again? The area where it really fails is pretty hidden (the metacity error from the previous output was in the middle).


Current system: Lenovo W520
Unity-for-Arch repos' build statuses and old packages: https://jenkins.noobdev.io/

Offline

#956 2012-09-12 06:06:41

slovdahl
Member
Registered: 2012-09-10
Posts: 10

Re: Progress on Unity under Arch Linux!

chenxiaolong wrote:
slovdahl wrote:

Now metacity and zenity was installed, but it still fails at the same spot with the same error message.

Could you post the full build log again? The area where it really fails is pretty hidden (the metacity error from the previous output was in the middle).

Sure, here it is.

Offline

#957 2012-09-12 06:12:25

chenxiaolong
Member
From: /home/chenxiaolong
Registered: 2010-11-03
Posts: 779

Re: Progress on Unity under Arch Linux!

slovdahl wrote:
chenxiaolong wrote:
slovdahl wrote:

Now metacity and zenity was installed, but it still fails at the same spot with the same error message.

Could you post the full build log again? The area where it really fails is pretty hidden (the metacity error from the previous output was in the middle).

Sure, here it is.

Thanks! There doesn't seem to be any other errors. Could you post the src/compiz-0.9.8.0/build/CMakeCache.txt file (I think that's what it's called). It should give me a little more information on what CMake is doing.

EDIT: I probably won't be able to look at it until tomorrow. It's 2:12 AM here smile

Last edited by chenxiaolong (2012-09-12 06:12:53)


Current system: Lenovo W520
Unity-for-Arch repos' build statuses and old packages: https://jenkins.noobdev.io/

Offline

#958 2012-09-12 07:44:37

\〠/
Member
Registered: 2011-02-26
Posts: 29

Re: Progress on Unity under Arch Linux!

aabmass wrote:

I'm having problems building gnome-control-center now. Output is:

  CCLD     libonline-accounts.la
  ITMRG  gnome-online-accounts-panel.desktop
make[4]: Leaving directory `/home/aaron/builds/unity/Unity-for-Arch/gnome-control-center-ubuntu/src/gnome-control-center-3.4.2/panels/online-accounts'
make[3]: Leaving directory `/home/aaron/builds/unity/Unity-for-Arch/gnome-control-center-ubuntu/src/gnome-control-center-3.4.2/panels/online-accounts'
Making all in region
make[3]: Entering directory `/home/aaron/builds/unity/Unity-for-Arch/gnome-control-center-ubuntu/src/gnome-control-center-3.4.2/panels/region'
  CC       region-module.lo
  CC       cc-region-panel.lo
  CC       gnome-region-panel-formats.lo
  CC       gnome-region-panel-lang.lo
  CC       gnome-region-panel-system.lo
  CC       gnome-region-panel-xkb.lo
  CC       gnome-region-panel-xkblt.lo
  CC       gnome-region-panel-xkbltadd.lo
  CC       gnome-region-panel-xkbot.lo
  CC       gnome-region-panel-xkbpv.lo
  CCLD     libregion.la
  ITMRG  gnome-region-panel.desktop
make[3]: Leaving directory `/home/aaron/builds/unity/Unity-for-Arch/gnome-control-center-ubuntu/src/gnome-control-center-3.4.2/panels/region'
Making all in info
make[3]: Entering directory `/home/aaron/builds/unity/Unity-for-Arch/gnome-control-center-ubuntu/src/gnome-control-center-3.4.2/panels/info'
  CC       info-module.lo
  CC       cc-info-panel.lo
cc-info-panel.c: In function 'default_app_changed':
cc-info-panel.c:934:18: warning: assignment makes pointer from integer without a cast [enabled by default]
  CC       hostname-helper.lo
  CC       gsd-disk-space-helper.lo
  CCLD     libinfo.la
  CC       test_hostname-hostname-helper.o
  CC       test_hostname-test-hostname.o
  CCLD     test-hostname
  ITMRG  gnome-info-panel.desktop
./test-hostname ./hostnames-test.txt > /dev/null
make[3]: Leaving directory `/home/aaron/builds/unity/Unity-for-Arch/gnome-control-center-ubuntu/src/gnome-control-center-3.4.2/panels/info'
Making all in sound
make[3]: Entering directory `/home/aaron/builds/unity/Unity-for-Arch/gnome-control-center-ubuntu/src/gnome-control-center-3.4.2/panels/sound'
make  all-recursive
make[4]: Entering directory `/home/aaron/builds/unity/Unity-for-Arch/gnome-control-center-ubuntu/src/gnome-control-center-3.4.2/panels/sound'
Making all in data
make[5]: Entering directory `/home/aaron/builds/unity/Unity-for-Arch/gnome-control-center-ubuntu/src/gnome-control-center-3.4.2/panels/sound/data'
Making all in icons
make[6]: Entering directory `/home/aaron/builds/unity/Unity-for-Arch/gnome-control-center-ubuntu/src/gnome-control-center-3.4.2/panels/sound/data/icons'
Making all in scalable
make[7]: Entering directory `/home/aaron/builds/unity/Unity-for-Arch/gnome-control-center-ubuntu/src/gnome-control-center-3.4.2/panels/sound/data/icons/scalable'
Making all in apps
make[8]: Entering directory `/home/aaron/builds/unity/Unity-for-Arch/gnome-control-center-ubuntu/src/gnome-control-center-3.4.2/panels/sound/data/icons/scalable/apps'
make[8]: Nothing to be done for `all'.
make[8]: Leaving directory `/home/aaron/builds/unity/Unity-for-Arch/gnome-control-center-ubuntu/src/gnome-control-center-3.4.2/panels/sound/data/icons/scalable/apps'
Making all in devices
make[8]: Entering directory `/home/aaron/builds/unity/Unity-for-Arch/gnome-control-center-ubuntu/src/gnome-control-center-3.4.2/panels/sound/data/icons/scalable/devices'
make[8]: Nothing to be done for `all'.
make[8]: Leaving directory `/home/aaron/builds/unity/Unity-for-Arch/gnome-control-center-ubuntu/src/gnome-control-center-3.4.2/panels/sound/data/icons/scalable/devices'
make[8]: Entering directory `/home/aaron/builds/unity/Unity-for-Arch/gnome-control-center-ubuntu/src/gnome-control-center-3.4.2/panels/sound/data/icons/scalable'
make[8]: Nothing to be done for `all-am'.
make[8]: Leaving directory `/home/aaron/builds/unity/Unity-for-Arch/gnome-control-center-ubuntu/src/gnome-control-center-3.4.2/panels/sound/data/icons/scalable'
make[7]: Leaving directory `/home/aaron/builds/unity/Unity-for-Arch/gnome-control-center-ubuntu/src/gnome-control-center-3.4.2/panels/sound/data/icons/scalable'
Making all in 16x16
make[7]: Entering directory `/home/aaron/builds/unity/Unity-for-Arch/gnome-control-center-ubuntu/src/gnome-control-center-3.4.2/panels/sound/data/icons/16x16'
Making all in status
make[8]: Entering directory `/home/aaron/builds/unity/Unity-for-Arch/gnome-control-center-ubuntu/src/gnome-control-center-3.4.2/panels/sound/data/icons/16x16/status'
make[8]: Nothing to be done for `all'.
make[8]: Leaving directory `/home/aaron/builds/unity/Unity-for-Arch/gnome-control-center-ubuntu/src/gnome-control-center-3.4.2/panels/sound/data/icons/16x16/status'
Making all in apps
make[8]: Entering directory `/home/aaron/builds/unity/Unity-for-Arch/gnome-control-center-ubuntu/src/gnome-control-center-3.4.2/panels/sound/data/icons/16x16/apps'
make[8]: Nothing to be done for `all'.
make[8]: Leaving directory `/home/aaron/builds/unity/Unity-for-Arch/gnome-control-center-ubuntu/src/gnome-control-center-3.4.2/panels/sound/data/icons/16x16/apps'
Making all in devices
make[8]: Entering directory `/home/aaron/builds/unity/Unity-for-Arch/gnome-control-center-ubuntu/src/gnome-control-center-3.4.2/panels/sound/data/icons/16x16/devices'
make[8]: Nothing to be done for `all'.
make[8]: Leaving directory `/home/aaron/builds/unity/Unity-for-Arch/gnome-control-center-ubuntu/src/gnome-control-center-3.4.2/panels/sound/data/icons/16x16/devices'
make[8]: Entering directory `/home/aaron/builds/unity/Unity-for-Arch/gnome-control-center-ubuntu/src/gnome-control-center-3.4.2/panels/sound/data/icons/16x16'
make[8]: Nothing to be done for `all-am'.
make[8]: Leaving directory `/home/aaron/builds/unity/Unity-for-Arch/gnome-control-center-ubuntu/src/gnome-control-center-3.4.2/panels/sound/data/icons/16x16'
make[7]: Leaving directory `/home/aaron/builds/unity/Unity-for-Arch/gnome-control-center-ubuntu/src/gnome-control-center-3.4.2/panels/sound/data/icons/16x16'
Making all in 22x22
make[7]: Entering directory `/home/aaron/builds/unity/Unity-for-Arch/gnome-control-center-ubuntu/src/gnome-control-center-3.4.2/panels/sound/data/icons/22x22'
Making all in status
make[8]: Entering directory `/home/aaron/builds/unity/Unity-for-Arch/gnome-control-center-ubuntu/src/gnome-control-center-3.4.2/panels/sound/data/icons/22x22/status'
make[8]: Nothing to be done for `all'.
make[8]: Leaving directory `/home/aaron/builds/unity/Unity-for-Arch/gnome-control-center-ubuntu/src/gnome-control-center-3.4.2/panels/sound/data/icons/22x22/status'
Making all in apps
make[8]: Entering directory `/home/aaron/builds/unity/Unity-for-Arch/gnome-control-center-ubuntu/src/gnome-control-center-3.4.2/panels/sound/data/icons/22x22/apps'
make[8]: Nothing to be done for `all'.
make[8]: Leaving directory `/home/aaron/builds/unity/Unity-for-Arch/gnome-control-center-ubuntu/src/gnome-control-center-3.4.2/panels/sound/data/icons/22x22/apps'
make[8]: Entering directory `/home/aaron/builds/unity/Unity-for-Arch/gnome-control-center-ubuntu/src/gnome-control-center-3.4.2/panels/sound/data/icons/22x22'
make[8]: Nothing to be done for `all-am'.
make[8]: Leaving directory `/home/aaron/builds/unity/Unity-for-Arch/gnome-control-center-ubuntu/src/gnome-control-center-3.4.2/panels/sound/data/icons/22x22'
make[7]: Leaving directory `/home/aaron/builds/unity/Unity-for-Arch/gnome-control-center-ubuntu/src/gnome-control-center-3.4.2/panels/sound/data/icons/22x22'
Making all in 24x24
make[7]: Entering directory `/home/aaron/builds/unity/Unity-for-Arch/gnome-control-center-ubuntu/src/gnome-control-center-3.4.2/panels/sound/data/icons/24x24'
Making all in status
make[8]: Entering directory `/home/aaron/builds/unity/Unity-for-Arch/gnome-control-center-ubuntu/src/gnome-control-center-3.4.2/panels/sound/data/icons/24x24/status'
make[8]: Nothing to be done for `all'.
make[8]: Leaving directory `/home/aaron/builds/unity/Unity-for-Arch/gnome-control-center-ubuntu/src/gnome-control-center-3.4.2/panels/sound/data/icons/24x24/status'
Making all in apps
make[8]: Entering directory `/home/aaron/builds/unity/Unity-for-Arch/gnome-control-center-ubuntu/src/gnome-control-center-3.4.2/panels/sound/data/icons/24x24/apps'
make[8]: Nothing to be done for `all'.
make[8]: Leaving directory `/home/aaron/builds/unity/Unity-for-Arch/gnome-control-center-ubuntu/src/gnome-control-center-3.4.2/panels/sound/data/icons/24x24/apps'
Making all in devices
make[8]: Entering directory `/home/aaron/builds/unity/Unity-for-Arch/gnome-control-center-ubuntu/src/gnome-control-center-3.4.2/panels/sound/data/icons/24x24/devices'
make[8]: Nothing to be done for `all'.
make[8]: Leaving directory `/home/aaron/builds/unity/Unity-for-Arch/gnome-control-center-ubuntu/src/gnome-control-center-3.4.2/panels/sound/data/icons/24x24/devices'
make[8]: Entering directory `/home/aaron/builds/unity/Unity-for-Arch/gnome-control-center-ubuntu/src/gnome-control-center-3.4.2/panels/sound/data/icons/24x24'
make[8]: Nothing to be done for `all-am'.
make[8]: Leaving directory `/home/aaron/builds/unity/Unity-for-Arch/gnome-control-center-ubuntu/src/gnome-control-center-3.4.2/panels/sound/data/icons/24x24'
make[7]: Leaving directory `/home/aaron/builds/unity/Unity-for-Arch/gnome-control-center-ubuntu/src/gnome-control-center-3.4.2/panels/sound/data/icons/24x24'
Making all in 32x32
make[7]: Entering directory `/home/aaron/builds/unity/Unity-for-Arch/gnome-control-center-ubuntu/src/gnome-control-center-3.4.2/panels/sound/data/icons/32x32'
Making all in status
make[8]: Entering directory `/home/aaron/builds/unity/Unity-for-Arch/gnome-control-center-ubuntu/src/gnome-control-center-3.4.2/panels/sound/data/icons/32x32/status'
make[8]: Nothing to be done for `all'.
make[8]: Leaving directory `/home/aaron/builds/unity/Unity-for-Arch/gnome-control-center-ubuntu/src/gnome-control-center-3.4.2/panels/sound/data/icons/32x32/status'
Making all in apps
make[8]: Entering directory `/home/aaron/builds/unity/Unity-for-Arch/gnome-control-center-ubuntu/src/gnome-control-center-3.4.2/panels/sound/data/icons/32x32/apps'
make[8]: Nothing to be done for `all'.
make[8]: Leaving directory `/home/aaron/builds/unity/Unity-for-Arch/gnome-control-center-ubuntu/src/gnome-control-center-3.4.2/panels/sound/data/icons/32x32/apps'
Making all in devices
make[8]: Entering directory `/home/aaron/builds/unity/Unity-for-Arch/gnome-control-center-ubuntu/src/gnome-control-center-3.4.2/panels/sound/data/icons/32x32/devices'
make[8]: Nothing to be done for `all'.
make[8]: Leaving directory `/home/aaron/builds/unity/Unity-for-Arch/gnome-control-center-ubuntu/src/gnome-control-center-3.4.2/panels/sound/data/icons/32x32/devices'
make[8]: Entering directory `/home/aaron/builds/unity/Unity-for-Arch/gnome-control-center-ubuntu/src/gnome-control-center-3.4.2/panels/sound/data/icons/32x32'
make[8]: Nothing to be done for `all-am'.
make[8]: Leaving directory `/home/aaron/builds/unity/Unity-for-Arch/gnome-control-center-ubuntu/src/gnome-control-center-3.4.2/panels/sound/data/icons/32x32'
make[7]: Leaving directory `/home/aaron/builds/unity/Unity-for-Arch/gnome-control-center-ubuntu/src/gnome-control-center-3.4.2/panels/sound/data/icons/32x32'
Making all in 48x48
make[7]: Entering directory `/home/aaron/builds/unity/Unity-for-Arch/gnome-control-center-ubuntu/src/gnome-control-center-3.4.2/panels/sound/data/icons/48x48'
Making all in apps
make[8]: Entering directory `/home/aaron/builds/unity/Unity-for-Arch/gnome-control-center-ubuntu/src/gnome-control-center-3.4.2/panels/sound/data/icons/48x48/apps'
make[8]: Nothing to be done for `all'.
make[8]: Leaving directory `/home/aaron/builds/unity/Unity-for-Arch/gnome-control-center-ubuntu/src/gnome-control-center-3.4.2/panels/sound/data/icons/48x48/apps'
Making all in devices
make[8]: Entering directory `/home/aaron/builds/unity/Unity-for-Arch/gnome-control-center-ubuntu/src/gnome-control-center-3.4.2/panels/sound/data/icons/48x48/devices'
make[8]: Nothing to be done for `all'.
make[8]: Leaving directory `/home/aaron/builds/unity/Unity-for-Arch/gnome-control-center-ubuntu/src/gnome-control-center-3.4.2/panels/sound/data/icons/48x48/devices'
make[8]: Entering directory `/home/aaron/builds/unity/Unity-for-Arch/gnome-control-center-ubuntu/src/gnome-control-center-3.4.2/panels/sound/data/icons/48x48'
make[8]: Nothing to be done for `all-am'.
make[8]: Leaving directory `/home/aaron/builds/unity/Unity-for-Arch/gnome-control-center-ubuntu/src/gnome-control-center-3.4.2/panels/sound/data/icons/48x48'
make[7]: Leaving directory `/home/aaron/builds/unity/Unity-for-Arch/gnome-control-center-ubuntu/src/gnome-control-center-3.4.2/panels/sound/data/icons/48x48'
make[7]: Entering directory `/home/aaron/builds/unity/Unity-for-Arch/gnome-control-center-ubuntu/src/gnome-control-center-3.4.2/panels/sound/data/icons'
make[7]: Nothing to be done for `all-am'.
make[7]: Leaving directory `/home/aaron/builds/unity/Unity-for-Arch/gnome-control-center-ubuntu/src/gnome-control-center-3.4.2/panels/sound/data/icons'
make[6]: Leaving directory `/home/aaron/builds/unity/Unity-for-Arch/gnome-control-center-ubuntu/src/gnome-control-center-3.4.2/panels/sound/data/icons'
Making all in symbolic-icons
make[6]: Entering directory `/home/aaron/builds/unity/Unity-for-Arch/gnome-control-center-ubuntu/src/gnome-control-center-3.4.2/panels/sound/data/symbolic-icons'
Making all in scalable
make[7]: Entering directory `/home/aaron/builds/unity/Unity-for-Arch/gnome-control-center-ubuntu/src/gnome-control-center-3.4.2/panels/sound/data/symbolic-icons/scalable'
Making all in status
make[8]: Entering directory `/home/aaron/builds/unity/Unity-for-Arch/gnome-control-center-ubuntu/src/gnome-control-center-3.4.2/panels/sound/data/symbolic-icons/scalable/status'
make[8]: Nothing to be done for `all'.
make[8]: Leaving directory `/home/aaron/builds/unity/Unity-for-Arch/gnome-control-center-ubuntu/src/gnome-control-center-3.4.2/panels/sound/data/symbolic-icons/scalable/status'
make[8]: Entering directory `/home/aaron/builds/unity/Unity-for-Arch/gnome-control-center-ubuntu/src/gnome-control-center-3.4.2/panels/sound/data/symbolic-icons/scalable'
make[8]: Nothing to be done for `all-am'.
make[8]: Leaving directory `/home/aaron/builds/unity/Unity-for-Arch/gnome-control-center-ubuntu/src/gnome-control-center-3.4.2/panels/sound/data/symbolic-icons/scalable'
make[7]: Leaving directory `/home/aaron/builds/unity/Unity-for-Arch/gnome-control-center-ubuntu/src/gnome-control-center-3.4.2/panels/sound/data/symbolic-icons/scalable'
make[7]: Entering directory `/home/aaron/builds/unity/Unity-for-Arch/gnome-control-center-ubuntu/src/gnome-control-center-3.4.2/panels/sound/data/symbolic-icons'
make[7]: Nothing to be done for `all-am'.
make[7]: Leaving directory `/home/aaron/builds/unity/Unity-for-Arch/gnome-control-center-ubuntu/src/gnome-control-center-3.4.2/panels/sound/data/symbolic-icons'
make[6]: Leaving directory `/home/aaron/builds/unity/Unity-for-Arch/gnome-control-center-ubuntu/src/gnome-control-center-3.4.2/panels/sound/data/symbolic-icons'
Making all in sounds
make[6]: Entering directory `/home/aaron/builds/unity/Unity-for-Arch/gnome-control-center-ubuntu/src/gnome-control-center-3.4.2/panels/sound/data/sounds'
  GEN      gnome-sounds-default.xml.in
  ITMRG  gnome-sounds-default.xml
make[6]: Leaving directory `/home/aaron/builds/unity/Unity-for-Arch/gnome-control-center-ubuntu/src/gnome-control-center-3.4.2/panels/sound/data/sounds'
make[6]: Entering directory `/home/aaron/builds/unity/Unity-for-Arch/gnome-control-center-ubuntu/src/gnome-control-center-3.4.2/panels/sound/data'
  ITMRG  gnome-sound-panel.desktop
  ITMRG  gnome-sound-applet.desktop
make[6]: Leaving directory `/home/aaron/builds/unity/Unity-for-Arch/gnome-control-center-ubuntu/src/gnome-control-center-3.4.2/panels/sound/data'
make[5]: Leaving directory `/home/aaron/builds/unity/Unity-for-Arch/gnome-control-center-ubuntu/src/gnome-control-center-3.4.2/panels/sound/data'
make[5]: Entering directory `/home/aaron/builds/unity/Unity-for-Arch/gnome-control-center-ubuntu/src/gnome-control-center-3.4.2/panels/sound'
  CC       gvc-balance-bar.lo
gvc-balance-bar.c: In function '_scale_box_new':
gvc-balance-bar.c:97:9: warning: 'gtk_rc_parse_string' is deprecated (declared at /usr/include/gtk-3.0/gtk/deprecated/gtkrc.h:174): Use 'GtkStyleContext' instead [-Wdeprecated-declarations]
  CC       gvc-mixer-dialog.lo
  CC       gvc-level-bar.lo
  CC       gvc-combo-box.lo
  CC       gvc-speaker-test.lo
  CC       gvc-sound-theme-chooser.lo
  CC       sound-theme-file-utils.lo
  CC       cc-sound-panel.lo
  CC       gvc-mixer-card.lo
  CC       gvc-mixer-stream.lo
  CC       gvc-channel-map.lo
  CC       gvc-mixer-sink.lo
  CC       gvc-mixer-source.lo
  CC       gvc-mixer-sink-input.lo
  CC       gvc-mixer-source-output.lo
  CC       gvc-mixer-event-role.lo
  CC       gvc-mixer-control.lo
  CC       gvc-channel-bar.lo
gvc-channel-bar.c: In function '_scale_box_new':
gvc-channel-bar.c:115:17: warning: 'gtk_vscale_new' is deprecated (declared at /usr/include/gtk-3.0/gtk/deprecated/gtkvscale.h:66): Use 'gtk_scale_new' instead [-Wdeprecated-declarations]
  CCLD     libgnomevolumecontrol.la
  CCLD     libsound.la
  CC       gvc-stream-status-icon.o
gvc-stream-status-icon.c: In function 'popup_dock':
gvc-stream-status-icon.c:176:9: warning: 'gdk_pointer_grab' is deprecated (declared at /usr/include/gtk-3.0/gdk/gdkmain.h:81): Use 'gdk_device_grab' instead [-Wdeprecated-declarations]
gvc-stream-status-icon.c:186:9: warning: 'gdk_keyboard_grab' is deprecated (declared at /usr/include/gtk-3.0/gdk/gdkmain.h:88): Use 'gdk_device_grab' instead [-Wdeprecated-declarations]
gvc-stream-status-icon.c:188:17: warning: 'gdk_display_pointer_ungrab' is deprecated (declared at /usr/include/gtk-3.0/gdk/gdkdisplay.h:55): Use 'gdk_device_ungrab' instead [-Wdeprecated-declarations]
gvc-stream-status-icon.c: In function 'on_menu_activate_open_volume_control':
gvc-stream-status-icon.c:224:9: warning: 'gdk_app_launch_context_new' is deprecated (declared at /usr/include/gtk-3.0/gdk/gdkapplaunchcontext.h:43): Use 'gdk_display_get_app_launch_context' instead [-Wdeprecated-declarations]
gvc-stream-status-icon.c: In function 'gvc_icon_release_grab':
gvc-stream-status-icon.c:307:9: warning: 'gdk_display_keyboard_ungrab' is deprecated (declared at /usr/include/gtk-3.0/gdk/gdkdisplay.h:58): Use 'gdk_device_ungrab' instead [-Wdeprecated-declarations]
gvc-stream-status-icon.c:308:9: warning: 'gdk_display_pointer_ungrab' is deprecated (declared at /usr/include/gtk-3.0/gdk/gdkdisplay.h:55): Use 'gdk_device_ungrab' instead [-Wdeprecated-declarations]
gvc-stream-status-icon.c: In function 'popdown_dock':
gvc-stream-status-icon.c:335:9: warning: 'gdk_display_keyboard_ungrab' is deprecated (declared at /usr/include/gtk-3.0/gdk/gdkdisplay.h:58): Use 'gdk_device_ungrab' instead [-Wdeprecated-declarations]
gvc-stream-status-icon.c:336:9: warning: 'gdk_display_pointer_ungrab' is deprecated (declared at /usr/include/gtk-3.0/gdk/gdkdisplay.h:55): Use 'gdk_device_ungrab' instead [-Wdeprecated-declarations]
  CC       gvc-applet.o
  CC       gvc-log.o
  CC       applet-main.o
  CCLD     gnome-sound-applet
make[5]: Leaving directory `/home/aaron/builds/unity/Unity-for-Arch/gnome-control-center-ubuntu/src/gnome-control-center-3.4.2/panels/sound'
make[4]: Leaving directory `/home/aaron/builds/unity/Unity-for-Arch/gnome-control-center-ubuntu/src/gnome-control-center-3.4.2/panels/sound'
make[3]: Leaving directory `/home/aaron/builds/unity/Unity-for-Arch/gnome-control-center-ubuntu/src/gnome-control-center-3.4.2/panels/sound'
Making all in sound-nua
make[3]: Entering directory `/home/aaron/builds/unity/Unity-for-Arch/gnome-control-center-ubuntu/src/gnome-control-center-3.4.2/panels/sound-nua'
make  all-recursive
make[4]: Entering directory `/home/aaron/builds/unity/Unity-for-Arch/gnome-control-center-ubuntu/src/gnome-control-center-3.4.2/panels/sound-nua'
Making all in data
make[5]: Entering directory `/home/aaron/builds/unity/Unity-for-Arch/gnome-control-center-ubuntu/src/gnome-control-center-3.4.2/panels/sound-nua/data'
  ITMRG  gnome-sound-nua-panel.desktop
make[5]: Leaving directory `/home/aaron/builds/unity/Unity-for-Arch/gnome-control-center-ubuntu/src/gnome-control-center-3.4.2/panels/sound-nua/data'
make[5]: Entering directory `/home/aaron/builds/unity/Unity-for-Arch/gnome-control-center-ubuntu/src/gnome-control-center-3.4.2/panels/sound-nua'
  CC       gvc-balance-bar.lo
gvc-balance-bar.c: In function '_scale_box_new':
gvc-balance-bar.c:93:9: warning: 'gtk_hscale_new' is deprecated (declared at /usr/include/gtk-3.0/gtk/deprecated/gtkhscale.h:60): Use 'gtk_scale_new' instead [-Wdeprecated-declarations]
gvc-balance-bar.c:97:9: warning: 'gtk_rc_parse_string' is deprecated (declared at /usr/include/gtk-3.0/gtk/deprecated/gtkrc.h:174): Use 'GtkStyleContext' instead [-Wdeprecated-declarations]
  CC       gvc-mixer-dialog.lo
gvc-mixer-dialog.c: In function 'active_input_update':
gvc-mixer-dialog.c:803:9: warning: passing argument 1 of 'g_hash_table_get_values' discards 'const' qualifier from pointer target type [enabled by default]
In file included from /usr/include/glib-2.0/glib.h:52:0,
                 from gvc-mixer-dialog.c:29:
/usr/include/glib-2.0/glib/ghash.h:101:13: note: expected 'struct GHashTable *' but argument is of type 'const struct GHashTable *'
gvc-mixer-dialog.c: In function 'active_output_update':
gvc-mixer-dialog.c:960:9: warning: passing argument 1 of 'g_hash_table_get_values' discards 'const' qualifier from pointer target type [enabled by default]
In file included from /usr/include/glib-2.0/glib.h:52:0,
                 from gvc-mixer-dialog.c:29:
/usr/include/glib-2.0/glib/ghash.h:101:13: note: expected 'struct GHashTable *' but argument is of type 'const struct GHashTable *'
  CC       gvc-level-bar.lo
  CC       gvc-combo-box.lo
gvc-combo-box.c: In function 'gvc_combo_box_set_profiles':
gvc-combo-box.c:213:9: warning: passing argument 1 of 'g_hash_table_get_keys' discards 'const' qualifier from pointer target type [enabled by default]
In file included from /usr/include/glib-2.0/glib.h:52:0,
                 from gvc-combo-box.c:27:
/usr/include/glib-2.0/glib/ghash.h:100:13: note: expected 'struct GHashTable *' but argument is of type 'const struct GHashTable *'
gvc-combo-box.c:220:17: warning: passing argument 1 of 'g_hash_table_lookup' discards 'const' qualifier from pointer target type [enabled by default]
In file included from /usr/include/glib-2.0/glib.h:52:0,
                 from gvc-combo-box.c:27:
/usr/include/glib-2.0/glib/ghash.h:79:13: note: expected 'struct GHashTable *' but argument is of type 'const struct GHashTable *'
  CC       gvc-speaker-test.lo
gvc-speaker-test.c: In function 'channel_control_new':
gvc-speaker-test.c:318:9: warning: 'gtk_vbox_new' is deprecated (declared at /usr/include/gtk-3.0/gtk/deprecated/gtkvbox.h:60): Use 'gtk_box_new' instead [-Wdeprecated-declarations]
gvc-speaker-test.c:343:9: warning: 'gtk_hbox_new' is deprecated (declared at /usr/include/gtk-3.0/gtk/deprecated/gtkhbox.h:62): Use 'gtk_box_new' instead [-Wdeprecated-declarations]
  CC       gvc-sound-theme-chooser.lo
  CC       sound-theme-file-utils.lo
  CC       cc-sound-panel.lo
  CC       gvc-mixer-card.lo
  CC       gvc-mixer-stream.lo
  CC       gvc-mixer-ui-device.lo
  CC       gvc-channel-map.lo
  CC       gvc-mixer-sink.lo
  CC       gvc-mixer-source.lo
  CC       gvc-mixer-sink-input.lo
  CC       gvc-mixer-source-output.lo
  CC       gvc-mixer-event-role.lo
  CC       gvc-mixer-control.lo
gvc-mixer-control.c: In function 'sync_devices':
gvc-mixer-control.c:1295:9: warning: passing argument 1 of 'g_list_length' discards 'const' qualifier from pointer target type [enabled by default]
In file included from /usr/include/glib-2.0/glib/ghash.h:35:0,
                 from /usr/include/glib-2.0/glib.h:52,
                 from gvc-mixer-control.c:29:
/usr/include/glib-2.0/glib/glist.h:99:10: note: expected 'struct GList *' but argument is of type 'const struct GList *'
gvc-mixer-control.c: In function 'update_sink':
gvc-mixer-control.c:1510:37: warning: assignment discards 'const' qualifier from pointer target type [enabled by default]
gvc-mixer-control.c: In function 'update_source':
gvc-mixer-control.c:1634:37: warning: assignment discards 'const' qualifier from pointer target type [enabled by default]
gvc-mixer-control.c: In function 'update_card':
gvc-mixer-control.c:2073:9: warning: passing argument 1 of 'g_list_length' discards 'const' qualifier from pointer target type [enabled by default]
In file included from /usr/include/glib-2.0/glib/ghash.h:35:0,
                 from /usr/include/glib-2.0/glib.h:52,
                 from gvc-mixer-control.c:29:
/usr/include/glib-2.0/glib/glist.h:99:10: note: expected 'struct GList *' but argument is of type 'const struct GList *'
  CC       gvc-channel-bar.lo
gvc-channel-bar.c: In function '_scale_box_new':
gvc-channel-bar.c:115:17: warning: 'gtk_vscale_new' is deprecated (declared at /usr/include/gtk-3.0/gtk/deprecated/gtkvscale.h:66): Use 'gtk_scale_new' instead [-Wdeprecated-declarations]
gvc-channel-bar.c:141:17: warning: 'gtk_hscale_new' is deprecated (declared at /usr/include/gtk-3.0/gtk/deprecated/gtkhscale.h:60): Use 'gtk_scale_new' instead [-Wdeprecated-declarations]
  CCLD     libgnomevolumecontrol.la
  CCLD     libsoundnua.la
make[5]: Leaving directory `/home/aaron/builds/unity/Unity-for-Arch/gnome-control-center-ubuntu/src/gnome-control-center-3.4.2/panels/sound-nua'
make[4]: Leaving directory `/home/aaron/builds/unity/Unity-for-Arch/gnome-control-center-ubuntu/src/gnome-control-center-3.4.2/panels/sound-nua'
make[3]: Leaving directory `/home/aaron/builds/unity/Unity-for-Arch/gnome-control-center-ubuntu/src/gnome-control-center-3.4.2/panels/sound-nua'
Making all in keyboard
make[3]: Entering directory `/home/aaron/builds/unity/Unity-for-Arch/gnome-control-center-ubuntu/src/gnome-control-center-3.4.2/panels/keyboard'
  CC       libkeyboard_la-keyboard-module.lo
  CC       libkeyboard_la-cc-keyboard-panel.lo
  CC       libkeyboard_la-cc-keyboard-item.lo
  CC       libkeyboard_la-wm-common.lo
  CC       libkeyboard_la-keyboard-general.lo
  CC       libkeyboard_la-keyboard-shortcuts.lo
keyboard-shortcuts.c: In function 'setup_dialog':
keyboard-shortcuts.c:1629:62: error: 'GTK_CELL_RENDERER_ACCEL_MODE_MODIFIER_TAP' undeclared (first use in this function)
keyboard-shortcuts.c:1629:62: note: each undeclared identifier is reported only once for each function it appears in
make[3]: *** [libkeyboard_la-keyboard-shortcuts.lo] Error 1
make[3]: Leaving directory `/home/aaron/builds/unity/Unity-for-Arch/gnome-control-center-ubuntu/src/gnome-control-center-3.4.2/panels/keyboard'
make[2]: *** [all-recursive] Error 1
make[2]: Leaving directory `/home/aaron/builds/unity/Unity-for-Arch/gnome-control-center-ubuntu/src/gnome-control-center-3.4.2/panels'
make[1]: *** [all-recursive] Error 1
make[1]: Leaving directory `/home/aaron/builds/unity/Unity-for-Arch/gnome-control-center-ubuntu/src/gnome-control-center-3.4.2'
make: *** [all] Error 2
==> ERROR: A failure occurred in build().
    Aborting...

Many thanks!

Builds fine here, are you sure you have proper compile/install order?

Offline

#959 2012-09-12 09:51:36

slovdahl
Member
Registered: 2012-09-10
Posts: 10

Re: Progress on Unity under Arch Linux!

chenxiaolong wrote:
slovdahl wrote:
chenxiaolong wrote:

Could you post the full build log again? The area where it really fails is pretty hidden (the metacity error from the previous output was in the middle).

Sure, here it is.

Thanks! There doesn't seem to be any other errors. Could you post the src/compiz-0.9.8.0/build/CMakeCache.txt file (I think that's what it's called). It should give me a little more information on what CMake is doing.

EDIT: I probably won't be able to look at it until tomorrow. It's 2:12 AM here smile

Here you go smile Thanks for helping out!

Offline

#960 2012-09-12 20:10:17

aabmass
Member
Registered: 2011-12-14
Posts: 34

Re: Progress on Unity under Arch Linux!

\〠/ wrote:
aabmass wrote:

I'm having problems building gnome-control-center now. Output is:

[various error messages]

Many thanks!

Builds fine here, are you sure you have proper compile/install order?

Alright, I did a full rebuild and everything went fine. Thanks!

Offline

#961 2012-09-12 21:23:11

Reded
Member
From: Manchester, England
Registered: 2012-02-21
Posts: 233

Re: Progress on Unity under Arch Linux!

So I finally got Unity to load up on Arch - I have a side-panel (And all of the fun Dash functions) But I appear to be missing a top bar. Well, I say missing - It's completely invisible apart from a couple of icons at the end.

There's also no option to change the launcher position/hide it (I have two monitors, only need it on one!) in the system settings.

I'm assuming I somehow missed a dependency when installing it.

Also, a couple of windows don't match my theming, and I don't appear to have a background (Also unable to change it in settings - Means my Unity launcher is perma-purple, which I actually secretly like)

Is there something dumb I haven't done here that's causing all this?

http://i50.tinypic.com/1zh1fk0.png

Plus, the photo lense doesn't seem to do anything sad

I've definately done goofed somewhere, any suggestions?

Last but hopefully not least, global menus. Is there any way to get those working? Those were amazing smile

Last edited by Reded (2012-09-12 21:45:10)


"Some humans would do anything to see if it was possible to do it. If you put a large switch in some cave somewhere, with a sign on it saying "End-of-the-World Switch. PLEASE DO NOT TOUCH", the paint wouldn't even have time to dry."

Offline

#962 2012-09-12 21:49:22

oi_wtf
Member
From: /home/wtf
Registered: 2012-03-11
Posts: 190

Re: Progress on Unity under Arch Linux!

The top bar is black, so with your black background, you wont see it very well...
Also it seems like gnome-settings-daemon wasn't launched or crashed, that's why the background wont change or other settings won't apply.

Last edited by oi_wtf (2012-09-12 21:54:49)


Laptop:   Arch Linux (x86_64) and Win8.1 (x86_64);  Intel Core i7-3630QM @ 2.40GHz, 8 GiB RAM, NViDiA GeForce GT 650M 2 GiB
Desktop: Arch Linux (x86_64) and Win8.1 (x86_64);  Intel Core i7-4771  @ 3.50GHz, 8 GiB RAM, NViDiA GeForce GTX 660 Ti 2GiB

Offline

#963 2012-09-12 22:55:15

Reded
Member
From: Manchester, England
Registered: 2012-02-21
Posts: 233

Re: Progress on Unity under Arch Linux!

Ha! I started gnome-settings-daemon and now it's all great! Thanks alot wink

Obviously, global menu's were working but were hidden within the black-on-black mass at the top too.

Photos lens still isn't working by the looks of it though, which is a slight annoyance, and I still can't change the settings on the launcher (Making it hide, putting it on just one screen) As the option isn't even there (That or it's changed since I tried out Ubuntu 12.04)

So far I'm super-happy though, I guess I'm one of the few Ubuntu-to-Arch refugees who *didn't* leave it because I'm a Unity hater, and it's great to see the progress the desktop is making! big_smile


"Some humans would do anything to see if it was possible to do it. If you put a large switch in some cave somewhere, with a sign on it saying "End-of-the-World Switch. PLEASE DO NOT TOUCH", the paint wouldn't even have time to dry."

Offline

#964 2012-09-12 23:18:32

oi_wtf
Member
From: /home/wtf
Registered: 2012-03-11
Posts: 190

Re: Progress on Unity under Arch Linux!

Well, same here, mostly...
I was a bit skeptic at first, when both gnome and ubuntu announced such big changes to the desktop.
I tried them both and Unity always worked better and I got used to it.
Also I could keep compiz and emerald when using Unity... yay!

The only thing I don't use is the launcher (the bar at the left), because I want my "window-switcher"/taskbar/whatever at the bottom of my screen,
but awn is doing a great job there, so no problems with that either big_smile

Last edited by oi_wtf (2012-09-12 23:23:20)


Laptop:   Arch Linux (x86_64) and Win8.1 (x86_64);  Intel Core i7-3630QM @ 2.40GHz, 8 GiB RAM, NViDiA GeForce GT 650M 2 GiB
Desktop: Arch Linux (x86_64) and Win8.1 (x86_64);  Intel Core i7-4771  @ 3.50GHz, 8 GiB RAM, NViDiA GeForce GTX 660 Ti 2GiB

Offline

#965 2012-09-13 00:06:32

Reded
Member
From: Manchester, England
Registered: 2012-02-21
Posts: 233

Re: Progress on Unity under Arch Linux!

Yeah I dislike gnome-3... I don't think anyone really saw Unity for what it was when it was first put in - It was just a huge, clunky application menu that didn't really do anything, but now they're adding features to it and showing what their plans really hold, I think people will warm up to it fast!

Unity adding all its features to justify the bloat, and gnome3 just seemingly doing nothing... I know which I'd rather have!


"Some humans would do anything to see if it was possible to do it. If you put a large switch in some cave somewhere, with a sign on it saying "End-of-the-World Switch. PLEASE DO NOT TOUCH", the paint wouldn't even have time to dry."

Offline

#966 2012-09-13 03:04:33

chenxiaolong
Member
From: /home/chenxiaolong
Registered: 2010-11-03
Posts: 779

Re: Progress on Unity under Arch Linux!

slovdahl wrote:
chenxiaolong wrote:
slovdahl wrote:

Sure, here it is.

Thanks! There doesn't seem to be any other errors. Could you post the src/compiz-0.9.8.0/build/CMakeCache.txt file (I think that's what it's called). It should give me a little more information on what CMake is doing.

EDIT: I probably won't be able to look at it until tomorrow. It's 2:12 AM here smile

Here you go smile Thanks for helping out!

Thanks! From the looks of the CMakeCache.txt file, CMake can't seem to find these packages:

bzr # Probably doesn't matter
java # Probably doesn't matter
libjpeg-turbo
libgl / nvidia-utils
libnotify
librsvg
cairo
gtk2
libpng
libxml2
pango

I'm also seeing some weird things being set, such as "GLIB_COMPILE_SCHEMAS-ADVANCED", which isn't in the source code and doesn't appear in the CMakeCache.txt files in any of my builds.

Have you tried deleting the src/ and pkg/ directories before rebuilding (sometimes, the solution is the most obvious one big_smile)?


Current system: Lenovo W520
Unity-for-Arch repos' build statuses and old packages: https://jenkins.noobdev.io/

Offline

#967 2012-09-13 03:58:25

chenxiaolong
Member
From: /home/chenxiaolong
Registered: 2010-11-03
Posts: 779

Re: Progress on Unity under Arch Linux!

Reded wrote:

Ha! I started gnome-settings-daemon and now it's all great! Thanks alot wink

Obviously, global menu's were working but were hidden within the black-on-black mass at the top too.

Photos lens still isn't working by the looks of it though, which is a slight annoyance, and I still can't change the settings on the launcher (Making it hide, putting it on just one screen) As the option isn't even there (That or it's changed since I tried out Ubuntu 12.04)

The unity photos lens requires some packages which I haven't packaged yet. I package them when I have some time smile

Reded wrote:

So far I'm super-happy though, I guess I'm one of the few Ubuntu-to-Arch refugees who *didn't* leave it because I'm a Unity hater, and it's great to see the progress the desktop is making! big_smile

big_smile


Current system: Lenovo W520
Unity-for-Arch repos' build statuses and old packages: https://jenkins.noobdev.io/

Offline

#968 2012-09-13 06:27:14

slovdahl
Member
Registered: 2012-09-10
Posts: 10

Re: Progress on Unity under Arch Linux!

chenxiaolong wrote:
slovdahl wrote:

Here you go smile Thanks for helping out!

Thanks! From the looks of the CMakeCache.txt file, CMake can't seem to find these packages:

bzr # Probably doesn't matter
java # Probably doesn't matter
libjpeg-turbo
libgl / nvidia-utils
libnotify
librsvg
cairo
gtk2
libpng
libxml2
pango

I'm also seeing some weird things being set, such as "GLIB_COMPILE_SCHEMAS-ADVANCED", which isn't in the source code and doesn't appear in the CMakeCache.txt files in any of my builds.

Have you tried deleting the src/ and pkg/ directories before rebuilding (sometimes, the solution is the most obvious one big_smile)?

Yeah, I do before every rebuild. The only dependencies that weren't installed are bzr and java. I installed bzr and java, but no luck. sad

Offline

#969 2012-09-13 08:47:34

Reded
Member
From: Manchester, England
Registered: 2012-02-21
Posts: 233

Re: Progress on Unity under Arch Linux!

chenxiaolong wrote:

Yep, the Xorg packages can be skipped. However, the Unity launcher's autohide feature will no longer work (until Xorg 1.13.0 is released).

I guess this is the reason the option isn't there? weirdly though I can set it just fine in ccsm with Arch's Xorg (under Unity Plugin settings) so no harm done big_smile

Are those much talked-about Webapps in your builds yet? I saw there's the libunity-webapps package but I'm not getting any fun webapp action yet sad Was wondering if it's a bug or just something not fully there yet.

I tried them in Ubuntu 12.10 and they don't seem to do much yet though, hopefully by the full release we will see something awesome come off those tongue the technology is there but from a users point of view they're just a bookmark sad


"Some humans would do anything to see if it was possible to do it. If you put a large switch in some cave somewhere, with a sign on it saying "End-of-the-World Switch. PLEASE DO NOT TOUCH", the paint wouldn't even have time to dry."

Offline

#970 2012-09-13 12:59:29

b9anders
Member
Registered: 2007-11-07
Posts: 681

Re: Progress on Unity under Arch Linux!

oi_wtf wrote:

The only thing I don't use is the launcher (the bar at the left), because I want my "window-switcher"/taskbar/whatever at the bottom of my screen,
but awn is doing a great job there, so no problems with that either big_smile

Me too. If I could switch the launcher/taskbar to the bottom, I'd be glad. Awn for me is basically just doing what the launcher would be doing if it could be set to the bottom instead of the side.

Offline

#971 2012-09-13 13:21:05

b9anders
Member
Registered: 2007-11-07
Posts: 681

Re: Progress on Unity under Arch Linux!

Just came across this screenshot:

http://fc08.deviantart.net/fs70/i/2012/ … 4obvte.png

where is he getting the options for the app menu from?

Offline

#972 2012-09-13 23:26:35

oi_wtf
Member
From: /home/wtf
Registered: 2012-03-11
Posts: 190

Re: Progress on Unity under Arch Linux!

@b9anders: Just click on the "filter results"-line on the right....

@unity-webapps: I did a bit of digging there already, it depends on about five to ten packages not avaiable for arch,
for example the packages for signond...
Also, I wanted to write packages for myself, but there was an issue with signond and cryptsetup I hadn't had the time or mood to solve.


Laptop:   Arch Linux (x86_64) and Win8.1 (x86_64);  Intel Core i7-3630QM @ 2.40GHz, 8 GiB RAM, NViDiA GeForce GT 650M 2 GiB
Desktop: Arch Linux (x86_64) and Win8.1 (x86_64);  Intel Core i7-4771  @ 3.50GHz, 8 GiB RAM, NViDiA GeForce GTX 660 Ti 2GiB

Offline

#973 2012-09-14 10:23:18

qiuwei
Member
Registered: 2009-12-18
Posts: 245

Re: Progress on Unity under Arch Linux!

have you experienced a behavior change in HUD?

I used to type the name of certain application to run it. But nowadays it seems not to work anymore. It opens the document which also matches the name instead of running the application.

Is it a new feature?
Thanks

Offline

#974 2012-09-15 19:06:07

oi_wtf
Member
From: /home/wtf
Registered: 2012-03-11
Posts: 190

Re: Progress on Unity under Arch Linux!

@chen,
you're missing some '/etc' in overlay-scrollbar/PKGBUILD...

  # Put X11 startup script in correct directory
  install -dm755 "${pkgdir}/etc/X11/xinit/xinitrc.d/"
  mv "${pkgdir}/X11/Xsession.d/81overlay-scrollbar" \ # <-- one /etc here
    "${pkgdir}/etc/X11/xinit/xinitrc.d/"
  chmod 755 "${pkgdir}/X11/xinit/xinitrc.d/81overlay-scrollbar" # <-- and one here

Laptop:   Arch Linux (x86_64) and Win8.1 (x86_64);  Intel Core i7-3630QM @ 2.40GHz, 8 GiB RAM, NViDiA GeForce GT 650M 2 GiB
Desktop: Arch Linux (x86_64) and Win8.1 (x86_64);  Intel Core i7-4771  @ 3.50GHz, 8 GiB RAM, NViDiA GeForce GTX 660 Ti 2GiB

Offline

#975 2012-09-16 02:15:38

oddfox
Member
From: Spokane, WA
Registered: 2012-08-26
Posts: 8
Website

Re: Progress on Unity under Arch Linux!

oi_wtf is correct, managed to get overlay-scrollbar to build correctly on my system yesterday with that tweak.  Also, I wanted to ask if missing window decorations because of a segfaulting gtk-window-decorator was a known issue right now because I have not been able to get it to work properly regardless of what GTK+ or window theme I use.  I had the idea earlier to try out emerald, via emerald-git in the AUR, and thankfully everything is working just fine now only with emerald decorations instead of the "native" ones.

Thanks for all the hard work put into this, guys!

Offline

Board footer

Powered by FluxBB