You are not logged in.

#1 2013-01-31 01:11:27

alexanderthegre
Member
Registered: 2012-07-29
Posts: 66

Diffutils fails to build

The latest diffutils pkgbuild doesn't build on my machine; it outputs:

In file included from exclude.c:31:0:
./stdio.h:1012:1: error: 'gets' undeclared here (not in a function)
make[3]: *** [exclude.o] Error 1
make[3]: Leaving directory `/home/jack/diffutils/src/diffutils-3.2/lib'
make[2]: *** [all-recursive] Error 1
make[2]: Leaving directory `/home/jack/diffutils/src/diffutils-3.2/lib'
make[1]: *** [all] Error 2
make[1]: Leaving directory `/home/jack/diffutils/src/diffutils-3.2/lib'
make: *** [all-recursive] Error 1
==> ERROR: A failure occurred in build().[m(B
Aborting...

I have the base-devel group installed. Is there a fix for this somewhere?

Offline

#2 2013-01-31 01:27:04

Allan
Developer
From: Brisbane, AU
Registered: 2007-06-09
Posts: 10,408
Website

Re: Diffutils fails to build

Build from SVN trunk.  Fix is there.

Offline

#3 2013-01-31 01:38:16

alexanderthegre
Member
Registered: 2012-07-29
Posts: 66

Re: Diffutils fails to build

Okay, thanks.

Offline

Board footer

Powered by FluxBB