You are not logged in.

#1 2003-10-22 12:47:03

rasat
Forum Fellow
From: Finland, working in Romania
Registered: 2002-12-27
Posts: 2,176
Website

KMyMoney2

KMyMoney2 - The Personal Finances Manager for KDE
http://kmymoney2.sourceforge.net/

Getting the following error:

mymoneyqifprofileeditordecl.cpp: At global scope:
mymoneyqifprofileeditordecl.cpp:255: error: no `void
   MyMoneyQifProfileEditorDecl::languageChange()' member function declared in class `MyMoneyQifProfileEditorDecl'
make[3]: *** [mymoneyqifprofileeditordecl.o] Error 1
make[3]: Leaving directory `/usr/abs/local/kmymoney/src/kmymoney2-0.5.1/kmymoney2/converter'
make[2]: *** [all-recursive] Error 1
make[2]: Leaving directory `/usr/abs/local/kmymoney/src/kmymoney2-0.5.1/kmymoney2'
make[1]: *** [all-recursive] Error 1
make[1]: Leaving directory `/usr/abs/local/kmymoney/src/kmymoney2-0.5.1'
make: *** [all] Error 2
==> Build Failed.  Aborting...
[root@localhost kmymoney]#

PKGBUILD

# $Id: PKGBUILD,v 1.1 2003/10/21 16:34:39 Exp $
# Contributor: Markku (rasat@pacific.net.sg)

pkgname=kmymoney2
pkgver=0.5.1
pkgrel=1
pkgdesc="The Personal Finances Manager for KDE"
pkgurl="http://umn.dl.sourceforge.net/sourceforge/kmymoney2"
depends=('kdebase')
source=($pkgurl/$pkgname-$pkgver.tar.bz2)

build() {
   cd $startdir/src/$pkgname-$pkgver
   ./configure --prefix=/opt
   make || return 1
   make DESTDIR=$startdir/pkg install
}

Offline

Board footer

Powered by FluxBB