You are not logged in.

#1 2013-03-08 17:16:28

From: Oro Verde, E. R., Argentina
Registered: 2012-02-13
Posts: 28

gcc-gcj PKGBUILD isn't working


I'm trying to install gcc-gcj (x64), in order to install pdftk. First I had to downgrade the texinfo becouse of a fail in some function.

Now, I'm having this check error, anyone have a clue? I don't know what to do and basic search didn't bring me anything.

Comparing stages 2 and 3
warning: gcc/cc1-checksum.o differs
warning: gcc/cc1plus-checksum.o differs
Bootstrap comparison failure!
gcc/gcc.o differs
make[2]: *** [compare] Error 1
make[2]: Leaving directory `/home/leandro/Downloads/gcc-gcj/src/gcc-4.7.2/build'
make[1]: *** [stage3-bubble] Error 2
make[1]: Leaving directory `/home/leandro/Downloads/gcc-gcj/src/gcc-4.7.2/build'
make: *** [all] Error 2
==> ERROR: A failure occurred in build().


#2 2013-03-09 14:28:46

From: Netherlands, Europe
Registered: 2005-10-04
Posts: 6,066

Re: gcc-gcj PKGBUILD isn't working

Are you using the aur package for gcc-gcj : ?

Booting with apg Openrc, NOT systemd.
Automounting : not needed, i prefer pmount
Aur helpers : makepkg + my own local repo === rarely need them


Board footer

Powered by FluxBB