You are not logged in.

#1 2023-01-10 08:58:02

fish_monster
Member
Registered: 2022-02-21
Posts: 9

Error when installing Macaulay2

When building Macaulay2 I get the following error(s):

+ rm -f '/home/my-name/macaulay2/src/M2/M2/usr-host/lib/*.la'
/usr/bin/install -c -d /home/my-name/macaulay2/src/M2/M2/usr-host/bin
/usr/bin/install: cannot create directory ‘/home/my-name/macaulay2/src/M2/M2/usr-host/bin’: File exists
make[2]: *** [../Makefile.library:135: .installed-6.2.0] Error 1
make[2]: Leaving directory '/home/my-name/macaulay2/src/M2/M2/libraries/csdp'
make[1]: *** [Makefile:7: all-in-csdp] Error 2
make[1]: Leaving directory '/home/my-name/macaulay2/src/M2/M2/libraries'
make: *** [GNUmakefile:251: all-in-libraries] Error 2
make: Leaving directory '/home/my-name/macaulay2/src/M2/M2'
==> ERROR: A failure occurred in build().
    Aborting...

How do I fix this? Removing the file bin and rerunning it does not change anything. Removing everything and starting from anew also not.

Offline

#2 2023-01-10 09:37:11

WorMzy
Forum Moderator
From: Scotland
Registered: 2010-06-16
Posts: 11,011
Website

Re: Error when installing Macaulay2

Mod note: moving to AUR Issues


Sakura:-
Mobo: MSI MAG X570S TORPEDO MAX // Processor: AMD Ryzen 9 5950X @4.9GHz // GFX: AMD Radeon RX 5700 XT // RAM: 32GB (4x 8GB) Corsair DDR4 (@ 3000MHz) // Storage: 1x 3TB HDD, 6x 1TB SSD, 2x 120GB SSD, 1x 275GB M2 SSD

Making lemonade from lemons since 2015.

Offline

Board footer

Powered by FluxBB