You are not logged in.

#1 2024-05-30 05:39:51

bababoey
Member
Registered: 2024-03-28
Posts: 9

I need help building wineasio

Running make 64 succeeds but make 32 spits out this error.

make build ARCH=i386 M=32
make[1]: Entering directory '/home/mrcuriouscat/Downloads/Compressed/wineasio-1.2.0'
gcc -c -I. -Irtaudio/include -I/usr/include/wine -I/usr/include/wine/windows -I/usr/include/wine-development -I/usr/include/wine-development/wine/windows -I/opt/wine-stable/include -I/opt/wine-stable/include/wine/windows -I/opt/wine-staging/include -I/opt/wine-staging/include/wine/windows  -m32 -D_REENTRANT -fPIC -Wall -pipe -fno-strict-aliasing -Wdeclaration-after-statement -Wwrite-strings -Wpointer-arith -Werror=implicit-function-declaration -D_REENTRANT -O2 -DNDEBUG -fvisibility=hidden -o build32/asio.c.o asio.c
gcc -c -I. -Irtaudio/include -I/usr/include/wine -I/usr/include/wine/windows -I/usr/include/wine-development -I/usr/include/wine-development/wine/windows -I/opt/wine-stable/include -I/opt/wine-stable/include/wine/windows -I/opt/wine-staging/include -I/opt/wine-staging/include/wine/windows  -m32 -D_REENTRANT -fPIC -Wall -pipe -fno-strict-aliasing -Wdeclaration-after-statement -Wwrite-strings -Wpointer-arith -Werror=implicit-function-declaration -D_REENTRANT -O2 -DNDEBUG -fvisibility=hidden -o build32/main.c.o main.c
gcc -c -I. -Irtaudio/include -I/usr/include/wine -I/usr/include/wine/windows -I/usr/include/wine-development -I/usr/include/wine-development/wine/windows -I/opt/wine-stable/include -I/opt/wine-stable/include/wine/windows -I/opt/wine-staging/include -I/opt/wine-staging/include/wine/windows  -m32 -D_REENTRANT -fPIC -Wall -pipe -fno-strict-aliasing -Wdeclaration-after-statement -Wwrite-strings -Wpointer-arith -Werror=implicit-function-declaration -D_REENTRANT -O2 -DNDEBUG -fvisibility=hidden -o build32/regsvr.c.o regsvr.c
winebuild -m32 --dll --fake-module -E wineasio.dll.spec build32/asio.c.o build32/main.c.o build32/regsvr.c.o -o build32/wineasio32.dll
winegcc build32/asio.c.o build32/main.c.o build32/regsvr.c.o -shared -m32 -mnocygwin wineasio.dll.spec -L/usr/lib32/wine -L/usr/lib/wine -L/usr/lib/i386-linux-gnu/wine -L/usr/lib/i386-linux-gnu/wine-development -L/opt/wine-stable/lib -L/opt/wine-stable/lib/wine -L/opt/wine-stable/lib32 -L/opt/wine-stable/lib32/wine -L/opt/wine-staging/lib -L/opt/wine-staging/lib/wine -L/opt/wine-staging/lib32 -L/opt/wine-staging/lib32/wine -ljack \
        -lodbc32 -lole32 -lwinmm -luuid -o build32/wineasio32.dll.so
/usr/bin/ld: cannot find -lodbc32: No such file or directory
collect2: error: ld returned 1 exit status
winegcc: /usr/bin/gcc failed
make[1]: *** [Makefile.mk:110: build32/wineasio32.dll.so] Error 2
make[1]: Leaving directory '/home/mrcuriouscat/Downloads/Compressed/wineasio-1.2.0'
make: *** [Makefile:17: 32] Error 2

wineasio and wineasio-git in the aur also fails to build.
I've installed this countless times and never had problems with it.

Offline

#2 2024-05-30 08:33:51

WorMzy
Forum Moderator
From: Scotland
Registered: 2010-06-16
Posts: 12,025
Website

Re: I need help building wineasio

Mod note: Moving to AUR Issues.


Sakura:-
Mobo: MSI MAG X570S TORPEDO MAX // Processor: AMD Ryzen 9 5950X @4.9GHz // GFX: AMD Radeon RX 5700 XT // RAM: 32GB (4x 8GB) Corsair DDR4 (@ 3000MHz) // Storage: 1x 3TB HDD, 6x 1TB SSD, 2x 120GB SSD, 1x 275GB M2 SSD

Making lemonade from lemons since 2015.

Online

#3 2024-05-30 11:28:26

Lone_Wolf
Forum Moderator
From: Netherlands, Europe
Registered: 2005-10-04
Posts: 12,159

Re: I need help building wineasio

/usr/bin/ld: cannot find -lodbc32: No such file or directory

Looks like a missing dependency, try installing https://aur.archlinux.org/packages/lib32-unixodbc


Disliking systemd intensely, but not satisfied with alternatives so focusing on taming systemd.


(A works at time B)  && (time C > time B ) ≠  (A works at time C)

Online

#4 2024-05-30 14:23:06

bababoey
Member
Registered: 2024-03-28
Posts: 9

Re: I need help building wineasio

I've found the issue!
Turns out it was an incompatibility with wine's latest version.
Using wine-staging 9.8-1 I was able to build with no errors.

Offline

Board footer

Powered by FluxBB