You are not logged in.

#1 2004-08-29 09:23:45

ganlu
Member
From: ChongQing, China
Registered: 2004-01-04
Posts: 338

Erroe when compile parted 1.6.12

exception.c:72: warning: conflicting types for built-in function 'log2'
make[3]: *** [exception.lo] Error 1
make[3]: Leaving directory `/mnt/storage/cache/abs/local/parted/src/parted-1.6.12/libparted'
make[2]: *** [all-recursive] Error 1
make[2]: Leaving directory `/mnt/storage/cache/abs/local/parted/src/parted-1.6.12/libparted'
make[1]: *** [all-recursive] Error 1
make[1]: Leaving directory `/mnt/storage/cache/abs/local/parted/src/parted-1.6.12'
make: *** [all] Error 2
==> ERROR: Build Failed.  Aborting...

I wanna get gparted, so I have to compile latest parted tarball for it, but when I compiled parted 1.6.12, I got the above error message. I am using the same pkgbuild as official old one. Anyone can help me? Thanks in advance.

Offline

Board footer

Powered by FluxBB