You are not logged in.

#1 2005-10-20 12:50:39

Mr Green
Forum Fellow
From: U.K.
Registered: 2003-12-21
Posts: 5,745

libmpeg2

Libmpeg2 under x86_64 gives me

 gcc -DHAVE_CONFIG_H -I. -I. -I../include -I../include -I../include -Wall -march=x86-64 -pipe -O3 -fomit-frame-po
inter -fno-common -MT libmpeg2arch_la-cpu_accel.lo -MD -MP -MF .deps/libmpeg2arch_la-cpu_accel.Tpo -c cpu_accel.c
  -fPIC -DPIC -o .libs/libmpeg2arch_la-cpu_accel.o
{standard input}: Assembler messages:
{standard input}:11: Error: suffix or operands invalid for `pop'
{standard input}:14: Error: suffix or operands invalid for `push'
{standard input}:17: Error: suffix or operands invalid for `pop'
{standard input}:24: Error: suffix or operands invalid for `push'
{standard input}:27: Error: suffix or operands invalid for `pop'
{standard input}:43: Error: suffix or operands invalid for `push'
{standard input}:46: Error: suffix or operands invalid for `pop'
{standard input}:60: Error: suffix or operands invalid for `push'
{standard input}:63: Error: suffix or operands invalid for `pop'
{standard input}:69: Error: suffix or operands invalid for `push'
{standard input}:72: Error: suffix or operands invalid for `pop'
make[2]: *** [libmpeg2arch_la-cpu_accel.lo] Error 1
make[2]: Leaving directory `/home/mrgreen/builds2/extra/lib/libmpeg2/src/mpeg2dec-0.4.0/libmpeg2'
make[1]: *** [all-recursive] Error 1
make[1]: Leaving directory `/home/mrgreen/builds2/extra/lib/libmpeg2/src/mpeg2dec-0.4.0/libmpeg2'
make: *** [all-recursive] Error 1
==> ERROR: Build Failed.  Aborting...

Any idea what it means?


Mr Green

Offline

Board footer

Powered by FluxBB