You are not logged in.
Pages: 1
I installed the xf86-input-wacom,but the "xsetwacom --list devices" cannot find anything, and gnome-setting's wacom setup cannot find the device either.
I manually modprobe wacom module,but nothing changed, still not work.
Here is some output.
dmesg output:
[ 665.556685] usbcore: registered new interface driver wacom
[ 1196.163014] usb 2-1.2: USB disconnect, device number 5
[ 1200.951107] usb 2-1.2: new full-speed USB device number 6 using ehci-pci
[ 4892.942177] usb 2-1.2: USB disconnect, device number 6
[ 4909.748608] usb 2-1.2: new full-speed USB device number 7 using ehci-pci
xinput output:
⎡ Virtual core pointer id=2 [master pointer (3)]
⎜ ↳ Virtual core XTEST pointer id=4 [slave pointer (2)]
⎜ ↳ Lenovo ThinkPad USB Laser Mouse id=9 [slave pointer (2)]
⎣ Virtual core keyboard id=3 [master keyboard (2)]
↳ Virtual core XTEST keyboard id=5 [slave keyboard (3)]
↳ Power Button id=6 [slave keyboard (3)]
↳ Power Button id=7 [slave keyboard (3)]
↳ Dell Dell USB Keyboard id=8 [slave keyboard (3)]
lsusb output:
Bus 001 Device 002: ID 8087:0020 Intel Corp. Integrated Rate Matching Hub
Bus 002 Device 002: ID 8087:0020 Intel Corp. Integrated Rate Matching Hub
Bus 001 Device 001: ID 1d6b:0002 Linux Foundation 2.0 root hub
Bus 002 Device 001: ID 1d6b:0002 Linux Foundation 2.0 root hub
Bus 002 Device 006: ID 056a:0301 Wacom Co., Ltd
Is this because of the kernel driver or something, can anyone help, thanks
Offline
I modified kernel module source to add CTL-671 support, it now works perfectly.
you can download dkms tarball below and install it.
Offline
HI
I tried the above tar file to compile my wacom but it didn't work. Below are the details of my system for your reference. Kindly let me know if any solution.
OS = Centos 6.4
arch = x86_64
Kernel = 2.6.32-358.11.1.el6.x86_64
Error
[root@xyz dkms_source_tree]# make
make -C /lib/modules/2.6.32-358.11.1.el6.x86_64/build M=/home/abcd/Downloads/test/dkms_source_tree modules
make[1]: Entering directory `/usr/src/kernels/2.6.32-358.11.1.el6.x86_64'
CC [M] /home/abcd/Downloads/test/dkms_source_tree/wacom_wac.o
/home/abcd/Downloads/test/dkms_source_tree/wacom_wac.c: In function âwacom_setup_input_capabilitiesâ:
/home/abcd/Downloads/test/dkms_source_tree/wacom_wac.c:1365: error: implicit declaration of function âinput_abs_set_resâ
/home/abcd/Downloads/test/dkms_source_tree/wacom_wac.c:1403: error: âINPUT_PROP_POINTERâ undeclared (first use in this function)
/home/abcd/Downloads/test/dkms_source_tree/wacom_wac.c:1403: error: (Each undeclared identifier is reported only once
/home/abcd/Downloads/test/dkms_source_tree/wacom_wac.c:1403: error: for each function it appears in.)
/home/abcd/Downloads/test/dkms_source_tree/wacom_wac.c:1403: error: âstruct input_devâ has no member named âpropbitâ
/home/abcd/Downloads/test/dkms_source_tree/wacom_wac.c:1450: error: âINPUT_PROP_DIRECTâ undeclared (first use in this function)
/home/abcd/Downloads/test/dkms_source_tree/wacom_wac.c:1450: error: âstruct input_devâ has no member named âpropbitâ
/home/abcd/Downloads/test/dkms_source_tree/wacom_wac.c:1476: error: âstruct input_devâ has no member named âpropbitâ
/home/abcd/Downloads/test/dkms_source_tree/wacom_wac.c:1490: error: âstruct input_devâ has no member named âpropbitâ
/home/abcd/Downloads/test/dkms_source_tree/wacom_wac.c:1538: error: âstruct input_devâ has no member named âpropbitâ
/home/abcd/Downloads/test/dkms_source_tree/wacom_wac.c:1571: error: âstruct input_devâ has no member named âpropbitâ
/home/abcd/Downloads/test/dkms_source_tree/wacom_wac.c:1585: error: âstruct input_devâ has no member named âpropbitâ
/home/abcd/Downloads/test/dkms_source_tree/wacom_wac.c:1597: error: âstruct input_devâ has no member named âpropbitâ
/home/abcd/Downloads/test/dkms_source_tree/wacom_wac.c:1603: error: âstruct input_devâ has no member named âpropbitâ
make[2]: *** [/home/abcd/Downloads/test/dkms_source_tree/wacom_wac.o] Error 1
make[1]: *** [_module_/home/abcd/Downloads/test/dkms_source_tree] Error 2
make[1]: Leaving directory `/usr/src/kernels/2.6.32-358.11.1.el6.x86_64'
make: *** [all] Error 2
Offline
Moderator comment:
sachin.murudkar,
Welcome to Arch Linux. You are going to have to ask that on the Centros boards. We are knowledgeable as to Arch Linux.
Our policy is to keep these boards strictly Arch so as to to create confusion to users of Arch.
Edit: But, it appears that whatever headers are in your kernel are not the same as those used to compile the kernel you are running. Note the Arch kernel number I am running is 3.12.
Last edited by ewaller (2013-11-22 15:07:54)
Nothing is too wonderful to be true, if it be consistent with the laws of nature -- Michael Faraday
The shortest way to ruin a country is to give power to demagogues.— Dionysius of Halicarnassus
---
How to Ask Questions the Smart Way
Offline
HI Ewaller
Thanks for you inputs .....! This was just a testing phase which I was trying with surely I will try with Arch Linux and will let you know the feed back.
cheers ...!!!
Offline
Cool. I am interested in what happens with an Arch 3.1x kernel.
Nothing is too wonderful to be true, if it be consistent with the laws of nature -- Michael Faraday
The shortest way to ruin a country is to give power to demagogues.— Dionysius of Halicarnassus
---
How to Ask Questions the Smart Way
Offline
Pages: 1