You are not logged in.

#1 2016-10-07 09:09:46

philippe972
Member
Registered: 2016-10-06
Posts: 1

conky-lua-arch fail to install

hi,

i don't succeed to install conky-lua-arch, i've got this error :

-- Checking for one of the modules 'lua=5.1;lua5.1;lua-5.1'
CMake Error at /usr/share/cmake-3.6/Modules/FindPkgConfig.cmake:646 (message):
  None of the required 'lua=5.1;lua5.1;lua-5.1' found
Call Stack (most recent call first):
  cmake/ConkyPlatformChecks.cmake:252 (pkg_search_module)
  CMakeLists.txt:37 (include)


-- Configuring incomplete, errors occurred!
See also "/tmp/yaourt-tmp-filip/aur-conky-lua/src/conky-1.10.1/CMakeFiles/CMakeOutput.log".
See also "/tmp/yaourt-tmp-filip/aur-conky-lua/src/conky-1.10.1/CMakeFiles/CMakeError.log".
==> ERREUR : Une erreur s’est produite dans build().
    Abandon...
==> ERREUR : Makepkg n'a pas pu construire conky-lua.

CMakeError.log :

Determining if the pthread_create exist failed with the following output:
Change Dir: /tmp/yaourt-tmp-filip/aur-conky-lua/src/conky-1.10.1/CMakeFiles/CMakeTmp

Run Build Command:"/usr/bin/make" "cmTC_0ca4f/fast"
/usr/bin/make -f CMakeFiles/cmTC_0ca4f.dir/build.make CMakeFiles/cmTC_0ca4f.dir/build
make[1] : on entre dans le répertoire « /tmp/yaourt-tmp-filip/aur-conky-lua/src/conky-1.10.1/CMakeFiles/CMakeTmp »
Building C object CMakeFiles/cmTC_0ca4f.dir/CheckSymbolExists.c.o
/usr/bin/cc    -march=x86-64 -mtune=generic -O2 -pipe -fstack-protector-strong     -o CMakeFiles/cmTC_0ca4f.dir/CheckSymbolExists.c.o   -c /tmp/yaourt-tmp-filip/aur-conky-lua/src/conky-1.10.1/CMakeFiles/CMakeTmp/CheckSymbolExists.c
Linking C executable cmTC_0ca4f
/usr/bin/cmake -E cmake_link_script CMakeFiles/cmTC_0ca4f.dir/link.txt --verbose=1
/usr/bin/cc  -march=x86-64 -mtune=generic -O2 -pipe -fstack-protector-strong     -Wl,-O1,--sort-common,--as-needed,-z,relro  CMakeFiles/cmTC_0ca4f.dir/CheckSymbolExists.c.o  -o cmTC_0ca4f -rdynamic 
CMakeFiles/cmTC_0ca4f.dir/CheckSymbolExists.c.o : Dans la fonction « main » :
CheckSymbolExists.c:(.text.startup+0x6) : référence indéfinie vers « pthread_create »
collect2: erreur : ld a retourné 1 code d'état d'exécution
make[1]: *** [CMakeFiles/cmTC_0ca4f.dir/build.make:98: cmTC_0ca4f] Error 1
make[1] : on quitte le répertoire « /tmp/yaourt-tmp-filip/aur-conky-lua/src/conky-1.10.1/CMakeFiles/CMakeTmp »
make: *** [Makefile:126: cmTC_0ca4f/fast] Error 2

File /tmp/yaourt-tmp-filip/aur-conky-lua/src/conky-1.10.1/CMakeFiles/CMakeTmp/CheckSymbolExists.c:
/* */
#include <pthread.h>

int main(int argc, char** argv)
{
  (void)argv;
#ifndef pthread_create
  return ((int*)(&pthread_create))[argc];
#else
  (void)argc;
  return 0;
#endif
}

Determining if the function pthread_create exists in the pthreads failed with the following output:
Change Dir: /tmp/yaourt-tmp-filip/aur-conky-lua/src/conky-1.10.1/CMakeFiles/CMakeTmp

Run Build Command:"/usr/bin/make" "cmTC_6971f/fast"
/usr/bin/make -f CMakeFiles/cmTC_6971f.dir/build.make CMakeFiles/cmTC_6971f.dir/build
make[1] : on entre dans le répertoire « /tmp/yaourt-tmp-filip/aur-conky-lua/src/conky-1.10.1/CMakeFiles/CMakeTmp »
Building C object CMakeFiles/cmTC_6971f.dir/CheckFunctionExists.c.o
/usr/bin/cc    -march=x86-64 -mtune=generic -O2 -pipe -fstack-protector-strong  -DCHECK_FUNCTION_EXISTS=pthread_create   -o CMakeFiles/cmTC_6971f.dir/CheckFunctionExists.c.o   -c /usr/share/cmake-3.6/Modules/CheckFunctionExists.c
Linking C executable cmTC_6971f
/usr/bin/cmake -E cmake_link_script CMakeFiles/cmTC_6971f.dir/link.txt --verbose=1
/usr/bin/cc  -march=x86-64 -mtune=generic -O2 -pipe -fstack-protector-strong  -DCHECK_FUNCTION_EXISTS=pthread_create   -Wl,-O1,--sort-common,--as-needed,-z,relro  CMakeFiles/cmTC_6971f.dir/CheckFunctionExists.c.o  -o cmTC_6971f -rdynamic -lpthreads 
/usr/bin/ld : ne peut trouver -lpthreads
collect2: erreur : ld a retourné 1 code d'état d'exécution
make[1]: *** [CMakeFiles/cmTC_6971f.dir/build.make:98: cmTC_6971f] Error 1
make[1] : on quitte le répertoire « /tmp/yaourt-tmp-filip/aur-conky-lua/src/conky-1.10.1/CMakeFiles/CMakeTmp »
make: *** [Makefile:126: cmTC_6971f/fast] Error 2


Determining if the pipe2 exist failed with the following output:
Change Dir: /tmp/yaourt-tmp-filip/aur-conky-lua/src/conky-1.10.1/CMakeFiles/CMakeTmp

Run Build Command:"/usr/bin/make" "cmTC_3a386/fast"
/usr/bin/make -f CMakeFiles/cmTC_3a386.dir/build.make CMakeFiles/cmTC_3a386.dir/build
make[1] : on entre dans le répertoire « /tmp/yaourt-tmp-filip/aur-conky-lua/src/conky-1.10.1/CMakeFiles/CMakeTmp »
Building C object CMakeFiles/cmTC_3a386.dir/CheckSymbolExists.c.o
/usr/bin/cc  -D_LARGEFILE64_SOURCE -D_POSIX_C_SOURCE=200809L  -std=c99 -march=x86-64 -mtune=generic -O2 -pipe -fstack-protector-strong     -o CMakeFiles/cmTC_3a386.dir/CheckSymbolExists.c.o   -c /tmp/yaourt-tmp-filip/aur-conky-lua/src/conky-1.10.1/CMakeFiles/CMakeTmp/CheckSymbolExists.c
/tmp/yaourt-tmp-filip/aur-conky-lua/src/conky-1.10.1/CMakeFiles/CMakeTmp/CheckSymbolExists.c: Dans la fonction ‘main’:
/tmp/yaourt-tmp-filip/aur-conky-lua/src/conky-1.10.1/CMakeFiles/CMakeTmp/CheckSymbolExists.c:8:19: erreur : ‘pipe2’ undeclared (first use in this function)
   return ((int*)(&pipe2))[argc];
                   ^~~~~
/tmp/yaourt-tmp-filip/aur-conky-lua/src/conky-1.10.1/CMakeFiles/CMakeTmp/CheckSymbolExists.c:8:19: note : each undeclared identifier is reported only once for each function it appears in
make[1]: *** [CMakeFiles/cmTC_3a386.dir/build.make:66: CMakeFiles/cmTC_3a386.dir/CheckSymbolExists.c.o] Error 1
make[1] : on quitte le répertoire « /tmp/yaourt-tmp-filip/aur-conky-lua/src/conky-1.10.1/CMakeFiles/CMakeTmp »
make: *** [Makefile:126: cmTC_3a386/fast] Error 2

File /tmp/yaourt-tmp-filip/aur-conky-lua/src/conky-1.10.1/CMakeFiles/CMakeTmp/CheckSymbolExists.c:
/* */
#include <unistd.h>

int main(int argc, char** argv)
{
  (void)argv;
#ifndef pipe2
  return ((int*)(&pipe2))[argc];
#else
  (void)argc;
  return 0;
#endif
}

Determining if the function iw_sockets_open exists failed with the following output:
Change Dir: /tmp/yaourt-tmp-filip/aur-conky-lua/src/conky-1.10.1/CMakeFiles/CMakeTmp

Run Build Command:"/usr/bin/make" "cmTC_725e8/fast"
/usr/bin/make -f CMakeFiles/cmTC_725e8.dir/build.make CMakeFiles/cmTC_725e8.dir/build
make[1] : on entre dans le répertoire « /tmp/yaourt-tmp-filip/aur-conky-lua/src/conky-1.10.1/CMakeFiles/CMakeTmp »
Building C object CMakeFiles/cmTC_725e8.dir/CheckFunctionExists.c.o
/usr/bin/cc  -D_LARGEFILE64_SOURCE -D_POSIX_C_SOURCE=200809L  -std=c99 -march=x86-64 -mtune=generic -O2 -pipe -fstack-protector-strong  -DCHECK_FUNCTION_EXISTS=iw_sockets_open   -o CMakeFiles/cmTC_725e8.dir/CheckFunctionExists.c.o   -c /usr/share/cmake-3.6/Modules/CheckFunctionExists.c
Linking C executable cmTC_725e8
/usr/bin/cmake -E cmake_link_script CMakeFiles/cmTC_725e8.dir/link.txt --verbose=1
/usr/bin/cc  -std=c99 -march=x86-64 -mtune=generic -O2 -pipe -fstack-protector-strong  -DCHECK_FUNCTION_EXISTS=iw_sockets_open   -Wl,-O1,--sort-common,--as-needed,-z,relro  CMakeFiles/cmTC_725e8.dir/CheckFunctionExists.c.o  -o cmTC_725e8 -rdynamic 
CMakeFiles/cmTC_725e8.dir/CheckFunctionExists.c.o : Dans la fonction « main » :
CheckFunctionExists.c:(.text.startup+0xe) : référence indéfinie vers « iw_sockets_open »
collect2: erreur : ld a retourné 1 code d'état d'exécution
make[1]: *** [CMakeFiles/cmTC_725e8.dir/build.make:98: cmTC_725e8] Error 1
make[1] : on quitte le répertoire « /tmp/yaourt-tmp-filip/aur-conky-lua/src/conky-1.10.1/CMakeFiles/CMakeTmp »
make: *** [Makefile:126: cmTC_725e8/fast] Error 2

Thanks for your ideas !

Offline

Board footer

Powered by FluxBB