You are not logged in.

#1 2017-05-26 08:36:54

MisterChoc
Member
Registered: 2013-02-17
Posts: 74

Cannot run vmware anymore kernel 4.11

Hello guys,

I'm used of having issues with VMWare but this is the first time that just nothing is happening when I try to run it (after a big update of my system)

kernel: 4.11.2-1
VMWare: 12.5.6-5528349

So at first when I updated VMWare told me that I needed gcc 7.1.1 but core uses gcc 6.3.1. I found a workaround in the wiki to pass that version check so I did it and built the vmware modules.
https://wiki.archlinux.org/index.php/VM … el_4.11.2B

Afterward when I run 'vmware' nothing happens...

└┼─$─┤▶ sudo systemctl status vmware
Failed to dump process list, ignoring: Unit vmware.service not found.
● vmware.service
   Loaded: not-found (Reason: No such file or directory)
   Active: active (exited) since Thu 2017-05-25 18:21:42 CEST; 16h ago
 Main PID: 413 (code=exited, status=0/SUCCESS)
      CPU: 278ms
   CGroup: /system.slice/vmware.service

May 25 18:21:51 archie vmnet-natd[593]: RTM_NEWLINK: name:docker0 index:6 flags:0x000010
May 25 18:21:51 archie vmnet-natd[593]: RTM_NEWADDR: index:6, addr:172.17.0.1
May 25 18:21:51 archie vmnet-natd[593]: RTM_NEWLINK: name:docker0 index:6 flags:0x000010
May 25 18:21:51 archie vmnetBridge[574]: RTM_NEWLINK: name:docker0 index:6 flags:0x00001
May 25 18:21:51 archie vmnetBridge[574]: Removing interface docker0 index:6
May 25 18:21:52 archie vmnet-natd[593]: RTM_NEWADDR: index:3, addr:192.168.0.114
May 25 18:21:52 archie vmnet-natd[593]: RTM_NEWROUTE: index:3
May 25 18:21:52 archie vmnet-natd[593]: RTM_DELROUTE: index:3
May 25 18:21:52 archie vmnetBridge[574]: RTM_NEWROUTE: index:3
May 25 18:21:52 archie vmnetBridge[574]: RTM_DELROUTE: index:3

I see nothing related to it in my logs... I also installed the 'vmware-patch' package from the AUR which solved my issues in the past but still nothing happens.

Any idea about this?

Thank you

Offline

#2 2017-05-26 10:56:11

harkor
Member
Registered: 2017-03-30
Posts: 7

Re: Cannot run vmware anymore kernel 4.11

I have the same problem, for now the gcc 7.1.1 is not release in Aur Core Repository. => https://www.archlinux.org/packages/testing/i686/gcc/

I think we need waiting the official release.

Someone else can confirm ?

Offline

#3 2017-05-26 11:53:27

MisterChoc
Member
Registered: 2013-02-17
Posts: 74

Re: Cannot run vmware anymore kernel 4.11

I tried to install gcc 7.1.1 from testing but then I got errors building the modules for vmware : (

Offline

#4 2017-05-30 09:51:52

juan_sck
Member
Registered: 2007-03-06
Posts: 26

Re: Cannot run vmware anymore kernel 4.11

Could you find any solution?
Cant compile either with stable gcc 7.1.1-2 and linux 4.11.3-1 (still with libpng 1.6.28-1),

2017-05-30T11:30:56.138+02:00| vthread-4| I125: Building module with command "/sbin/make -j8 -C /tmp/modconfig-VVVXfm/vmmon-only auto-build HEADER_DIR=/lib/modules/4.11.3-1-ARCH/build/include CC=/sbin/gcc IS_GCC_3=no"
2017-05-30T11:30:58.128+02:00| vthread-4| W115: Failed to build vmmon.  Failed to execute the build command.
2017-05-30T11:30:58.130+02:00| vthread-4| I125: Setting destination path for vmnet to "/lib/modules/4.11.3-1-ARCH/misc/vmnet.ko".
2017-05-30T11:30:58.130+02:00| vthread-4| I125: Extracting the vmnet source from "/usr/lib/vmware/modules/source/vmnet.tar".
2017-05-30T11:30:58.136+02:00| vthread-4| I125: Successfully extracted the vmnet source.
2017-05-30T11:30:58.136+02:00| vthread-4| I125: Building module with command "/sbin/make -j8 -C /tmp/modconfig-VVVXfm/vmnet-only auto-build HEADER_DIR=/lib/modules/4.11.3-1-ARCH/build/include CC=/sbin/gcc IS_GCC_3=no"
2017-05-30T11:31:00.191+02:00| vthread-4| W115: Failed to build vmnet.  Failed to execute the build command.

Offline

#5 2017-07-01 01:01:17

si_faisal
Member
Registered: 2017-07-01
Posts: 2

Re: Cannot run vmware anymore kernel 4.11

this my error look like
after apply patch vmnet can compile, but still, vmmon cannot

make: Entering directory '/tmp/modconfig-ZbAE8C/vmmon-only'
Using kernel build system.
/sbin/make -C /lib/modules/4.11.6-3-zen/build/include/.. SUBDIRS=$PWD SRCROOT=$PWD/. \
  MODULEBUILDDIR= modules
make[1]: Entering directory '/usr/lib/modules/4.11.6-3-zen/build'
  CC [M]  /tmp/modconfig-ZbAE8C/vmmon-only/linux/driver.o
  CC [M]  /tmp/modconfig-ZbAE8C/vmmon-only/linux/hostif.o
  CC [M]  /tmp/modconfig-ZbAE8C/vmmon-only/linux/driverLog.o
  CC [M]  /tmp/modconfig-ZbAE8C/vmmon-only/common/memtrack.o
  CC [M]  /tmp/modconfig-ZbAE8C/vmmon-only/common/apic.o
  CC [M]  /tmp/modconfig-ZbAE8C/vmmon-only/common/vmx86.o
  CC [M]  /tmp/modconfig-ZbAE8C/vmmon-only/common/cpuid.o
/tmp/modconfig-ZbAE8C/vmmon-only/linux/driver.c:891:1: error: expected declaration specifiers or ‘...’ before ‘{’ token
 {
 ^
/tmp/modconfig-ZbAE8C/vmmon-only/linux/driver.c:1074:4: error: unknown type name ‘SyncFunc’
    SyncFunc      func;
    ^~~~~~~~
/tmp/modconfig-ZbAE8C/vmmon-only/linux/driver.c:1076:3: error: storage class specified for parameter ‘SyncFuncArgs’
 } SyncFuncArgs;
   ^~~~~~~~~~~~
/tmp/modconfig-ZbAE8C/vmmon-only/linux/driver.c:1096:1: error: storage class specified for parameter ‘LinuxDriverSyncCallHook’
 LinuxDriverSyncCallHook(void *data)  // IN:
 ^~~~~~~~~~~~~~~~~~~~~~~
/tmp/modconfig-ZbAE8C/vmmon-only/linux/driver.c:1097:1: error: expected ‘;’, ‘,’ or ‘)’ before ‘{’ token
 {
 ^
/tmp/modconfig-ZbAE8C/vmmon-only/linux/driver.c:71:13: warning: ‘LinuxDriverQueue’ used but never defined
 static void LinuxDriverQueue(VMLinux *vmLinux);
             ^~~~~~~~~~~~~~~~
/tmp/modconfig-ZbAE8C/vmmon-only/linux/driver.c:72:13: warning: ‘LinuxDriverDequeue’ used but never defined
 static void LinuxDriverDequeue(VMLinux *vmLinux);
             ^~~~~~~~~~~~~~~~~~
/tmp/modconfig-ZbAE8C/vmmon-only/linux/driver.c:73:13: warning: ‘LinuxDriverCheckPadding’ used but never defined
 static Bool LinuxDriverCheckPadding(void);
             ^~~~~~~~~~~~~~~~~~~~~~~
/tmp/modconfig-ZbAE8C/vmmon-only/linux/driver.c:108:12: warning: ‘LinuxDriverFault’ used but never defined
 static int LinuxDriverFault(struct vm_fault *fault);
            ^~~~~~~~~~~~~~~~
/tmp/modconfig-ZbAE8C/vmmon-only/linux/driver.c:114:12: warning: ‘LinuxDriverMmap’ used but never defined
 static int LinuxDriverMmap(struct file *filp, struct vm_area_struct *vma);
            ^~~~~~~~~~~~~~~
/tmp/modconfig-ZbAE8C/vmmon-only/linux/driver.c:466:1: warning: ‘LinuxDriverAllocPages’ defined but not used [-Wunused-function]
 LinuxDriverAllocPages(unsigned int gfpFlag, // IN
 ^~~~~~~~~~~~~~~~~~~~~
/tmp/modconfig-ZbAE8C/vmmon-only/linux/driver.c:119:36: warning: ‘vmuser_mops’ defined but not used [-Wunused-variable]
 static struct vm_operations_struct vmuser_mops = {
                                    ^~~~~~~~~~~
make[2]: *** [scripts/Makefile.build:294: /tmp/modconfig-ZbAE8C/vmmon-only/linux/driver.o] Error 1
make[2]: *** Waiting for unfinished jobs....
make[1]: *** [Makefile:1502: _module_/tmp/modconfig-ZbAE8C/vmmon-only] Error 2
make[1]: Leaving directory '/usr/lib/modules/4.11.6-3-zen/build'
make: *** [Makefile:120: vmmon.ko] Error 2

any help and clues are appreciated

Offline

Board footer

Powered by FluxBB