You are not logged in.

#1 2006-06-28 00:58:34

Psy[K0]tiC
Member
From: Portugal
Registered: 2006-03-29
Posts: 4

Problems compiling cheops, and running nessusd...

Hi!

1) I've been trying to compile cheops 0.61 and i've no success, i also try extract files from a debian package .deb and install it and no success at all. The package isn't in the repos... Anyone with the same problem?

2) Anyone have success running nessus? I've a updated arch and when i try to run the deamon I get an error:

nessusd: error while loading shared libraries: libssl.so.0.9.7: cannot open shared object file: No such file or directory

How I get this library?!

Please help smile
Psy[K0]tiC

Offline

#2 2006-06-28 01:57:53

Snowman
Developer/Forum Fellow
From: Montreal, Canada
Registered: 2004-08-20
Posts: 5,212

Re: Problems compiling cheops, and running nessusd...

1. What compiling error are you getting?

2. Nessus-core needs to be rebuild against the new openssl.  It's already been bug reported. You could get the PKGBUILD from ABS and rebuild it.

Offline

#3 2006-06-28 21:33:32

Psy[K0]tiC
Member
From: Portugal
Registered: 2006-03-29
Posts: 4

Re: Problems compiling cheops, and running nessusd...

I give up!! sad

I'm student and I don't have time at this moment to put this thing working. I'm in exames season.
By the way the error in cheops is:

[root@yotta cheops-0.61]# make
gcc -g -O2 -Wall -DDEFAULT_PATH="/usr/local/share/cheops" -DLIB_PATH="/usr/local/lib/cheops" -I/usr/include/gtk-1.2 -I/usr/include/glib-1.2 -I/usr/lib/glib/include  -DHAS_GMODULE    -c -o cheops.o cheops.c
cheops.c: In function 'page_dispatch':
cheops.c:742: error: label at end of compound statement
make: *** [cheops.o] Error 1

I also try compiling cheops-ng without success. I hope someone make arch packages for this exelent tools soon... I've never make an arch package, I have to learn first, but like I say, I don't have time now.
Maybe I make the package for nessus-3.0.3, the package in extra is 2.2.7...

Offline

#4 2006-07-18 22:01:32

dninja
Member
From: Sheffield, UK
Registered: 2006-04-29
Posts: 374
Website

Re: Problems compiling cheops, and running nessusd...

This problem is still there for the binary package. Anyone any timeline on getting a fix for this?

Offline

#5 2006-07-18 23:38:09

Snowman
Developer/Forum Fellow
From: Montreal, Canada
Registered: 2004-08-20
Posts: 5,212

Re: Problems compiling cheops, and running nessusd...

I just sumitted a bug report specific about the openssl issue:
http://bugs.archlinux.org/task/5070
perhaps it will speed things up...

Offline

#6 2006-07-19 07:55:54

Kern
Member
From: UK
Registered: 2005-02-09
Posts: 460

Re: Problems compiling cheops, and running nessusd...

wrt to nessus i had similar probs. full upgrade didnt solve.

then nessus latest 2.2.8x (under pacman) was released.
still no joy. the file hadnt migrated across the full range of mirrors after 5 days so was stuck at 2.2.7x and errors like yours.


messed with my list of mirrors in /etc/pacman.d and all updated successfully.


pacman -Qi |grep nessus
nessus-core 2.2.8-1
nessus-libraries 2.2.8-1
nessus-plugins 2.2.8-1

Offline

#7 2006-07-19 08:17:26

dninja
Member
From: Sheffield, UK
Registered: 2006-04-29
Posts: 374
Website

Re: Problems compiling cheops, and running nessusd...

Which mirrors are you using?

Offline

#8 2006-07-19 12:27:45

Kern
Member
From: UK
Registered: 2005-02-09
Posts: 460

Re: Problems compiling cheops, and running nessusd...

Offline

Board footer

Powered by FluxBB